program: Gaussian 09
title: 000104549
version: EM64L-G09RevD.01
frameworkgroup: C1[X(C6H10O6S)]
method: RPBEPBE
basis: SDD
operation: Freq
keyword: #p
keyword: freq=noraman
keyword: PBEPBE/SDD
title: #p freq=noraman PBEPBE/SDD
converged: YES YES NO NO
title: Mulliken charges:
elementType: S O O O O O O C C C C C C H H H H H H H H H H
charge: 1.207019 -0.269634 -0.440070 -0.539558 -0.246822 -0.441152 -0.466140 -0.272848 -0.242330 0.169178 0.341530 -0.750569 -0.622806 0.240559 0.246007 0.238607 0.252233 0.238761 0.246936 0.217640 0.232693 0.255619 0.405146
chargesum: 0.00000
title: Mulliken charges with hydrogens summed into heavy atoms:
elementType: S O O O O O O C C C C C C
charge: 1.207019 -0.269634 -0.440070 -0.134412 -0.246822 -0.441152 -0.466140 0.213719 0.248511 0.169178 0.341530 -0.047233 -0.134494
polarizability: 1.56840824e+02 -1.67208849e+00 1.08087509e+02 1.19325044e+01 -2.27070913e+00 8.58682283e+01
1716.lowfreq: -9.7450 -0.0004 0.0015 0.0018 1.7607 4.0701 8.3309 16.6532 20.5450
frequency: 6.8630 16.4725 19.9448 59.6096 64.7087 100.0325 137.7145 144.7985 147.6201 164.7863 227.5857 230.8175 280.5278 291.7011 317.0196 339.4370 352.4724 370.0805 393.0954 433.8628 481.3743 562.5547 575.7258 589.5158 630.6630 783.0014 791.5754 824.1624 866.3700 873.3763 948.8784 991.4213 993.3088 1002.3258 1010.7804 1033.6012 1053.8808 1096.3249 1104.6705 1117.0445 1194.8263 1243.2471 1287.3334 1350.9444 1368.1428 1399.1694 1417.1475 1448.9040 1457.0432 1461.5323 1472.6753 1611.5964 1652.7835 2991.9949 2999.8689 3010.6941 3072.6473 3075.1789 3083.2913 3101.4271 3106.1476 3218.3780 3456.3190
redmass: 6.3660 5.7643 6.7734 5.5767 4.4510 3.8082 2.8637 4.2695 3.1228 1.0904 4.1880 2.4680 2.9849 2.7487 8.8594 6.4674 9.5988 3.1053 3.6070 5.9824 4.1853 5.2979 11.4544 4.1833 1.5369 2.1173 3.9861 3.2641 6.2296 5.1820 1.9393 3.9948 1.3452 4.4505 1.4200 2.3522 1.5048 2.4680 2.4598 1.5975 1.0937 1.1022 3.2105 1.3103 1.4906 1.1626 1.2514 1.0763 1.0446 1.0805 1.0623 11.1820 5.1980 1.0364 1.0558 1.0597 1.1070 1.0971 1.1054 1.1001 1.0624 1.1157 1.0655
irintensity: 2.0703 2.0678 0.2670 2.4566 4.3206 25.4726 7.6587 16.5641 40.2216 1.5768 18.5821 3.8039 7.9646 38.9464 33.9027 9.2998 15.1458 7.2997 0.2622 24.1401 2.3146 68.9697 112.2937 22.2978 9.6825 6.1056 8.0409 57.2535 53.0576 79.2110 9.0782 72.7091 70.2189 71.2579 21.2305 11.9146 6.7560 48.4660 398.3903 152.9904 6.7068 9.4107 114.4677 1.8538 1.3722 21.4705 10.4902 15.6092 16.0591 43.3906 32.4534 152.2034 4.7828 13.3892 14.5035 24.3835 5.4638 14.4689 20.2929 25.4017 2.7061 4.6992 63.2560
temp: 298.150 k
press: 1.00000 atm
elementType: 16 8 8 8 8 8 8 6 6 6 6 6 6 1 1 1 1 1 1 1 1 1 1
symmnumber: 1
zpe: 424142.0 jmol-1
zpe.correction: 0.161547 hartree
zpe.thermalcorrener: 0.177717 hartree
zpe.thermalcorrenthalpy: 0.178661 hartree
zpe.thermalcorrgfe: 0.113138 hartree
zpe.sumelectzpe: -1082.784887 hartree
zpe.sumelectthermal: -1082.768718 hartree
zpe.sumelectthermalent: -1082.767773 hartree
zpe.sumelectthermalfe: -1082.833296 hartree
dipole: 3.1687 -0.6878 -0.2995
dipole: 3.2563
quadrupole: -99.3280 -86.9630 -80.6813
quadrupole: 13.1240 -3.6314 2.3912
quadrupole: -10.3373 2.0278 8.3095 13.1240 -3.6314 2.3912
hfenergy: -1082.9464346 hartree
pointgroup: C01 [X(C6H10O6S1)]
dipole: 1.248834 0.2734707 0.0831319 debye
dipolederiv: 1.9942155 0.1551938 -0.016241 0.1171781 1.4892799 0.0647204 -0.1547849 -0.0370395 1.6400421 -1.6804573 0.2162455 0.2948657 0.2801938 -0.4754274 0.0212687 0.3737275 0.0307341 -0.3707191 -0.9439058 -0.2177007 -0.1457946 -0.2572294 -0.5793638 -0.106732 -0.1137817 -0.0832899 -0.4906237 -0.4064017 0.1431569 0.0794318 0.0919015 -0.4781602 -0.039484 -0.1981871 -0.1632862 -0.9488717 -0.7036453 0.0326123 0.0741483 -0.0800223 -0.8395321 0.2505864 0.1808656 0.2186054 -0.4505205 -0.5299146 -0.0187179 0.0247469 -0.1106582 -0.5498882 0.0783342 0.1031456 0.0849371 -0.4630048 -0.6435662 0.0090132 0.0315958 0.1428603 -0.551228 -0.035637 0.0409269 0.0144594 -0.4491752 0.2328165 0.0595489 0.0910983 0.3436696 0.4369391 0.1014305 0.5842899 0.2328399 0.3679464 0.7770237 -0.2016368 -0.0206999 -0.577829 0.3201734 0.0466681 -0.1585849 -0.036847 0.2375922 1.9305758 -0.2857033 -0.3415451 -0.2660287 0.9867606 -0.2486238 -0.4973119 -0.2338569 0.4585981 -0.3035539 0.3261923 -0.0781321 0.3188348 0.0057561 -0.1346438 -0.0493231 -0.1389643 0.0339799 -0.0625474 -0.0760001 0.0684355 -0.0628783 -0.0442655 0.0746655 0.0737568 0.0729696 0.0110867 -0.0349444 -0.1864472 -0.0175326 0.0106352 -0.0565079 -0.104598 -0.1051181 -0.0473508 -0.2685177 -0.0277081 0.0979075 0.0133273 -0.0129067 -0.055342 -0.0386253 -0.0934999 -0.0263703 0.0716142 0.0664455 -0.0252348 -0.0255286 -0.085813 0.0140128 0.0748446 -0.1007614 -0.0091323 -0.0766931 -0.1062178 -0.0579613 -0.0407848 0.0944495 -0.0435952 -0.0728525 -0.0060875 -0.0699885 0.0477273 0.040451 0.0460663 0.011936 0.1389173 0.0540599 -0.0021071 -0.0488335 0.0459731 -0.0569282 0.1070411 -0.0031493 0.0720046 -0.0221788 0.065875 -0.0670182 0.0824788 -0.027621 -0.0758471 -0.0151988 -0.0811707 -0.0761671 -0.0874267 0.0811836 0.0083364 -0.0851445 -0.0261937 0.0409866 -0.0305399 0.1553665 -0.0194033 0.088259 -0.060243 0.0458253 0.0120747 0.0178579 0.1007606 0.044824 0.0769551 0.0069742 0.1079009 -0.0170308 0.0447309 -0.002901 0.0530663 0.1475241 0.1164666 -0.0260115 0.0419368 -0.0468505 0.0287146 0.0856935 0.0485753 0.0795808 0.1414392 0.1787413 -0.1385247 -0.028672 -0.1249786 0.2678292 -0.0467829 0.1144787 0.0489168 0.3516037 unknown
polarizability: 156.9544226|-0.5283765|106.9572889|-11.7470803|-5.2869635|86.8848504 unknown
InChI: InChI=1S/C6H10O6S/c1-5(2)6(7)11-3-4-12-13(8,9)10/h8H,1,3-4H2,2H3
charge 0 multiplicity 1
23 atoms
S  -3.482071 -0.319689 -0.025064
O  1.128293 0.300689 0.31352
O  -1.710947 0.151637 -0.354897
O  -3.650734 -0.920057 -1.725614
O  2.807985 1.472316 -0.794623
O  -3.625024 -1.571646 0.956058
O  -4.330895 1.019101 0.229576
C  -1.131462 1.106294 0.626834
C  0.244854 1.466486 0.090091
C  2.43138 0.430009 -0.204396
C  3.237695 -0.80643 0.051563
C  2.590771 -1.966929 0.778139
C  4.523868 -0.807709 -0.397313
H  -1.763723 2.012777 0.68466
H  -1.049932 0.626772 1.618775
H  0.646291 2.34018 0.638097
H  0.216926 1.716645 -0.98503
H  2.256166 -1.66712 1.787513
H  1.691036 -2.31887 0.242853
H  3.297674 -2.807762 0.876108
H  5.176245 -1.675103 -0.251428
H  4.934202 0.06455 -0.917757
H  -2.871101 -0.535243 -2.227264
