program: Gaussian 09
title: 000008433
version: EM64L-G09RevD.01
frameworkgroup: C1[X(C15H12O2)]
method: RPBEPBE
basis: SDD
operation: Freq
keyword: #pfreq=noraman
keyword: PBEPBE/SDD
title: #p freq=noraman PBEPBE/SDD
converged: YES YES NO NO
title: Mulliken charges:
elementType: O O C C C C C C C C C C C C C C C H H H H H H H H H H H H
charge: -0.199569 -0.207037 -0.673024 0.131944 0.122797 0.294059 0.329072 -0.331271 -0.331682 -0.345182 -0.350392 -0.249458 -0.254174 -0.226566 -0.231903 -0.220046 -0.225208 0.246719 0.280006 0.249835 0.232164 0.279933 0.277327 0.233314 0.230207 0.236202 0.233082 0.235949 0.232902
chargesum: 0.00000
title: Mulliken charges with hydrogens summed into heavy atoms:
elementType: O O C C C C C C C C C C C C C C C
charge: -0.199569 -0.207037 -0.146299 0.131944 0.122797 0.294059 0.329072 -0.081437 -0.099518 -0.065249 -0.073065 -0.016144 -0.023967 0.009636 0.001179 0.015902 0.007694
polarizability: 2.31384807e+02 2.57625767e+00 1.44066788e+02 2.00360986e+01 -4.36349055e+00 1.14937878e+02
1716.lowfreq: -5.2595 -2.1101 -0.0005 -0.0003 0.0006 7.5314 15.4280 33.0574 40.3796
frequency: 15.3970 32.9591 40.3675 70.5174 102.1802 145.6744 150.1169 176.2437 222.4855 291.9241 364.6758 400.0468 400.5429 409.7634 423.9966 444.5189 464.2707 565.9644 579.6841 602.2466 613.1969 613.7357 680.1625 694.3102 696.6394 738.5583 763.9619 771.1320 836.5761 856.3580 860.2072 917.4824 945.0162 953.5845 981.7620 989.3394 989.5317 991.2232 992.7126 1010.4769 1012.4450 1017.4902 1027.2121 1045.7338 1086.6256 1087.3463 1149.6504 1174.0066 1174.1638 1188.3520 1190.7485 1209.9949 1280.1164 1286.6105 1318.0660 1320.6096 1388.2826 1389.1178 1429.9110 1436.2262 1437.5055 1479.0975 1481.1564 1569.4740 1572.8775 1596.5206 1602.1251 1611.5030 1615.3507 2993.4420 3056.4514 3128.3632 3130.4906 3137.8442 3139.4245 3148.9354 3150.3485 3159.2059 3159.7319 3169.5645 3170.5802
redmass: 6.0349 4.7520 3.7367 6.2342 7.3081 5.1578 5.2357 5.2974 3.9805 6.4422 4.5732 2.8048 2.8105 3.0605 3.8780 6.9878 3.9449 3.0680 5.0061 4.9664 6.4342 6.3801 6.1151 1.7730 1.8496 4.2707 2.0557 1.7614 3.7327 1.2530 1.2516 2.1189 1.4466 1.8110 3.7146 2.4573 5.3566 2.2237 1.3814 1.3583 1.3839 2.8948 2.0357 2.2271 1.5778 1.5956 1.3264 1.0605 1.0705 1.1287 1.1182 2.2161 3.3484 2.1136 1.3355 1.3424 9.2221 9.2266 1.2431 2.2523 1.9406 2.1990 2.2016 7.0878 6.9415 6.8234 6.6859 6.2282 7.1602 1.0599 1.0987 1.0850 1.0851 1.0880 1.0880 1.0925 1.0924 1.0961 1.0961 1.1012 1.1014
irintensity: 0.7989 1.5441 0.0242 3.1485 1.0758 0.1320 0.2684 1.0296 10.2169 4.9043 0.5995 0.1688 0.1431 0.8278 0.6310 0.4150 0.3723 38.5956 10.4523 28.9817 1.8223 2.1304 1.4149 46.5797 49.3288 4.4965 46.8467 58.1967 10.2276 0.8895 0.5361 1.1187 2.2992 4.9486 44.8565 0.2670 4.5011 1.5718 0.5165 0.8353 4.4592 29.0083 0.5954 21.4748 8.6128 7.3896 27.0906 0.3592 5.0936 47.4229 3.8743 75.4390 360.2167 63.5226 11.3312 9.2737 2.0894 2.6434 18.5560 28.4572 36.3858 0.3878 3.9677 128.1009 88.2881 43.1154 61.7090 13.5513 26.1556 10.7042 8.5732 0.6553 0.4142 5.7120 5.7873 27.2294 16.2838 21.3283 17.7063 21.8781 20.5857
temp: 298.150 k
press: 1.00000 atm
elementType: 8 8 6 6 6 6 6 6 6 6 6 6 6 6 6 6 6 1 1 1 1 1 1 1 1 1 1 1 1
symmnumber: 1
zpe: 589293.9 jmol-1
zpe.correction: 0.224450 hartree
zpe.thermalcorrener: 0.238769 hartree
zpe.thermalcorrenthalpy: 0.239713 hartree
zpe.thermalcorrgfe: 0.180390 hartree
zpe.sumelectzpe: -728.060679 hartree
zpe.sumelectthermal: -728.046360 hartree
zpe.sumelectthermalent: -728.045416 hartree
zpe.sumelectthermalfe: -728.104740 hartree
dipole: -2.3505 -2.9358 -3.2810
dipole: 4.9909
quadrupole: -73.4942 -102.2759 -99.7649
quadrupole: -5.1547 2.1578 -3.2773
quadrupole: 18.3507 -10.4309 -7.9199 -5.1547 2.1578 -3.2773
hfenergy: -728.2851295 hartree
pointgroup: C01 [X(C15H12O2)]
dipole: -0.7873302 1.7707134 -0.3166858 debye
polarizability: 227.9760209|-26.8418436|122.5271482|-8.4664737|-10.5035981|139.8863037 unknown
InChI: InChI=1S/C15H12O2/c16-14(12-7-3-1-4-8-12)11-15(17)13-9-5-2-6-10-13/h1-10H,11H2
charge 0 multiplicity 1
29 atoms
O  -0.408861 -1.253296 -0.812218
O  1.615097 -1.657531 2.104139
C  -0.024461 -0.075471 1.296447
C  -0.868159 -0.473803 0.069671
C  1.376364 -0.701483 1.310462
C  -2.259756 0.084079 -0.036873
C  2.441866 -0.151251 0.41216
C  -2.825735 0.932231 0.953525
C  2.211284 0.931317 -0.47824
C  -3.03285 -0.258034 -1.180799
C  3.735836 -0.738421 0.467787
C  -4.13714 1.429952 0.800304
C  3.254309 1.418311 -1.293924
C  -4.341139 0.2401 -1.332957
C  4.7765 -0.252804 -0.3464
C  -4.896831 1.086389 -0.342326
C  4.538566 0.829113 -1.229313
H  0.033122 1.028602 1.357928
H  -0.545484 -0.427413 2.206452
H  -2.253263 1.203417 1.846851
H  1.219607 1.390298 -0.551145
H  -2.58082 -0.916067 -1.930425
H  3.892189 -1.574729 1.157122
H  -4.567993 2.080992 1.568576
H  3.068145 2.250841 -1.981011
H  -4.929787 -0.028022 -2.21692
H  5.769871 -0.712048 -0.298485
H  -5.915187 1.473445 -0.45947
H  5.347609 1.208086 -1.863919
