program: Gaussian 09
title: 000104502
version: EM64L-G09RevD.01
frameworkgroup: C1[X(C9H10Cl2)]
method: RPBEPBE
basis: SDD
operation: Freq
keyword: #pfreq=noraman
keyword: PBEPBE/SDD
title: #p freq=noraman PBEPBE/SDD
converged: NO YES NO NO
title: Mulliken charges:
elementType: Cl Cl C C C C C C C C C H H H H H H H H H H
charge: -0.074359 -0.086966 0.470781 -0.510059 0.531725 -0.389209 -0.389144 -0.358501 -0.358421 -0.578552 -0.771330 0.236575 0.236628 0.238954 0.238985 0.238169 0.238172 0.274736 0.274670 0.268570 0.268576
chargesum: 0.00000
title: Mulliken charges with hydrogens summed into heavy atoms:
elementType: Cl Cl C C C C C C C C C
charge: -0.074359 -0.086966 0.470781 -0.036856 0.531725 -0.150255 -0.150159 -0.120331 -0.120249 -0.029146 -0.234184
polarizability: 1.79505913e+02 8.23761304e+00 7.61594527e+01 -4.09018504e-02 1.01600963e-01 9.65389921e+01
1716.lowfreq: -15.9034 -8.3265 -4.6858 -0.0027 0.0005 0.0019 27.9005 40.0982 41.7475
frequency: 27.6820 40.0924 41.7215 76.2217 117.0424 196.6020 235.5369 278.1005 370.1089 374.0409 402.3368 472.0003 539.9893 614.2143 636.3018 664.5769 726.9253 781.1972 786.2566 824.3277 849.1911 858.0305 901.2449 962.3640 975.9514 979.6215 1012.9820 1041.9286 1090.2627 1119.2390 1141.1478 1191.5430 1213.0154 1233.1413 1246.0916 1249.5230 1265.6101 1319.1058 1319.6319 1386.3616 1412.6784 1455.3391 1462.1316 1479.4457 1506.9358 1583.3194 1621.3849 3013.3621 3057.8900 3066.6078 3072.7629 3120.0544 3121.5466 3141.1149 3143.5709 3147.4004 3147.9526
redmass: 3.1297 13.0046 4.4109 2.8698 7.6036 8.5917 6.7160 2.3254 2.3762 6.5577 2.8190 4.0032 5.1098 4.5318 6.6365 4.7170 3.7082 1.1349 3.9975 3.2943 1.2493 2.0833 1.5244 1.3736 1.3990 1.4265 2.9443 4.5113 1.2454 1.0694 1.1303 1.1174 2.5750 2.6142 1.2478 1.2197 1.2258 1.3656 1.2482 6.4214 2.7342 1.0874 1.1245 1.1034 2.6654 6.6540 6.4072 1.0599 1.0563 1.0575 1.1037 1.0875 1.0877 1.0981 1.1109 1.0978 1.1109
irintensity: 0.1450 0.8226 2.2018 1.8379 2.1595 0.5140 11.3539 1.5911 0.0157 13.5604 0.0036 6.6733 4.8450 92.4635 0.0040 89.9066 15.9670 2.9524 1.6594 11.7966 0.0103 32.1560 0.1315 0.2788 0.3206 0.7272 2.6296 13.8413 3.0596 2.0146 6.4189 2.7969 0.5036 20.4400 35.0090 9.5680 0.6709 21.6215 0.0223 0.0144 7.7631 2.3800 6.2808 10.6628 6.9871 0.2157 11.9293 14.5453 18.3240 23.7825 6.7318 0.6917 19.2045 14.7207 22.7035 0.3903 11.2057
temp: 298.150 k
press: 1.00000 atm
elementType: 17 17 6 6 6 6 6 6 6 6 6 1 1 1 1 1 1 1 1 1 1
symmnumber: 1
zpe: 431342.1 jmol-1
zpe.correction: 0.164290 hartree
zpe.thermalcorrener: 0.175497 hartree
zpe.thermalcorrenthalpy: 0.176442 hartree
zpe.thermalcorrgfe: 0.123815 hartree
zpe.sumelectzpe: -1268.271601 hartree
zpe.sumelectthermal: -1268.260393 hartree
zpe.sumelectthermalent: -1268.259449 hartree
zpe.sumelectthermalfe: -1268.312075 hartree
dipole: 0.9407 -2.3548 0.0080
dipole: 2.5357
quadrupole: -98.8953 -82.5964 -72.0763
quadrupole: -5.9109 0.0293 0.0441
quadrupole: -14.3726 1.9262 12.4464 -5.9109 0.0293 0.0441
hfenergy: -1268.4358905 hartree
pointgroup: C01 [X(C9H10Cl2)]
dipole: 0.3973114 0.0128381 -0.9150039 debye
dipolederiv: -0.8621507 -0.0008601 0.1152714 -0.0007366 -0.1780404 0.0005142 0.0870644 0.0004645 -0.2200684 -0.5647018 0.0027858 -0.1598647 0.0085437 -0.1809596 0.0055724 -0.5763778 0.0061994 -0.5671611 0.3488463 -0.000154 -0.0253654 -0.0019428 0.0153704 0.0016327 0.1091839 0.0014394 -0.0971838 -0.2031587 -0.0009686 0.0905071 -0.0011916 0.1142984 0.0009393 0.1010432 0.0008655 0.0316091 -0.2516387 0.0003494 -0.0026938 -0.0018285 -0.0362226 0.0008906 0.1607181 0.0006241 -0.099488 -0.1809532 -0.0985901 0.0053763 -0.11977 0.0477857 -0.0325456 0.0205308 -0.0062192 -0.145507 -0.1802964 0.0990477 0.0082075 0.1198361 0.0459134 0.0377661 0.0238274 0.0114365 -0.144332 0.0157709 0.0827095 0.0092576 0.0100757 0.0696948 -0.0189637 0.0016236 0.0176013 -0.1234776 0.0154259 -0.0827468 0.0070991 -0.0100028 0.0697801 0.0241496 0.0014758 -0.012425 -0.1232862 0.9963364 0.0006216 -0.0955 0.0029625 0.1891641 -0.0000636 -0.2541996 0.0002224 0.2020889 0.8075179 -0.0046145 0.2654365 -0.0078879 0.1773301 -0.007649 0.5022439 -0.0079813 0.7012912 0.0181436 0.0223867 -0.0307897 0.0628521 -0.0453096 0.0957602 -0.0174927 0.0607755 0.0266053 0.0177805 -0.0216725 -0.031794 -0.0624396 -0.0404771 -0.0974937 -0.0194928 -0.0625929 0.0221811 0.0210451 0.1010646 -0.0198254 0.0956286 -0.0413848 0.0069325 -0.008216 0.0065364 0.1415918 0.020491 -0.1006278 -0.0226085 -0.0955624 -0.0402821 -0.0118296 -0.0108737 -0.0114346 0.1410965 0.0164899 -0.0961282 0.0024967 -0.0864933 -0.0368438 -0.0071751 -0.0165668 -0.0085027 0.1411731 0.0170657 0.0958391 0.005099 0.0867434 -0.0376958 0.0023327 -0.0142187 0.0037141 0.141453 -0.0402913 0.055068 -0.034374 0.0282136 -0.0252917 0.0925672 -0.0080134 0.0507711 0.0282748 -0.0403841 -0.0540985 -0.0359847 -0.0279153 -0.0212065 -0.0939204 -0.008693 -0.0521174 0.0242486 0.0141737 -0.0199414 -0.0251532 -0.1031173 -0.0243973 0.0750328 -0.0380885 0.0541405 -0.0387757 0.014488 0.0205301 -0.0247978 0.1040323 -0.0212258 -0.0744497 -0.0354779 -0.0535177 -0.0423334 unknown
polarizability: 178.9285445|-0.258138|96.5367037|11.2750176|0.2420077|76.7391097 unknown
InChI: InChI=1S/C9H10Cl2/c10-6-5-8-1-3-9(7-11)4-2-8/h1-4H,5-7H2
charge 0 multiplicity 1
21 atoms
Cl -4.928452 -0.003034 0.779354
Cl 3.991761 -0.026391 1.6370
C  -0.928212 0.010845 -0.513507
C  -2.451073 0.014152 -0.576586
C  1.924527 0.003678 -0.307192
C  -0.20196 1.228083 -0.445327
C  -0.205735 -1.210016 -0.478413
C  1.204136 1.225668 -0.343891
C  1.200337 -1.214629 -0.376832
C  -3.033726 -0.005152 0.847092
C  3.418804 -0.000065 -0.201237
H  -2.820479 0.912894 -1.10194
H  -2.823444 -0.868024 -1.127308
H  -0.742922 2.181549 -0.480736
H  -0.749532 -2.160535 -0.539784
H  1.750082 2.175048 -0.290572
H  1.743382 -2.166761 -0.349184
H  -2.762442 -0.916251 1.400826
H  -2.761348 0.890069 1.425675
H  3.886036 0.909931 -0.603126
H  3.883261 -0.900057 -0.628115
