program: Gaussian 09
title: 000008431
version: EM64L-G09RevD.01
frameworkgroup: C1[X(C7H14N2O2)]
method: RPBEPBE
basis: SDD
operation: Freq
keyword: #p
keyword: freq=noraman
keyword: PBEPBE/SDD
title: #p freq=noraman PBEPBE/SDD
converged: YES YES NO NO
title: Mulliken charges:
elementType: O O N N C C C C C C C H H H H H H H H H H H H H H
charge: -0.317165 -0.310654 -0.155653 -0.299223 -0.346326 -0.344516 -0.399329 -0.401636 0.311107 -0.208128 -0.677650 0.219798 0.250536 0.250267 0.223802 0.192018 0.216156 0.217556 0.195323 0.270869 0.224887 0.224753 0.210226 0.227248 0.225735
chargesum: 0.00000
title: Mulliken charges with hydrogens summed into heavy atoms:
elementType: O O N N C C C C C C C
charge: -0.317165 -0.310654 -0.155653 -0.028354 0.124007 0.129553 0.008845 0.011243 0.311107 0.241512 -0.014441
polarizability: 1.22488534e+02 9.92622612e-01 9.53139126e+01 -2.19031265e+00 -1.95026098e+00 7.13349632e+01
1716.lowfreq: -10.5295 -0.0005 -0.0003 0.0004 7.4200 11.3081 40.7574 53.4203 101.0221
frequency: 40.7423 53.3298 101.0198 114.0329 123.6149 219.5807 249.5044 261.6666 307.7443 321.1812 362.3539 402.1605 448.6612 485.1088 529.0801 615.2515 671.1856 690.5375 768.3428 801.2837 831.6845 845.0128 876.6610 918.8704 982.3929 1032.8440 1047.7581 1052.5497 1067.6654 1104.7218 1113.0076 1139.4184 1156.8291 1164.6656 1196.8190 1215.8506 1248.6157 1261.6100 1277.4101 1317.1902 1334.9724 1346.6329 1363.7579 1381.0097 1397.8400 1416.2917 1443.4008 1458.2304 1460.0951 1462.4511 1463.4947 1467.7087 1477.2713 1491.8613 1638.3686 2869.1206 2876.6378 2979.5503 2984.0341 2993.2785 3007.4707 3042.7895 3046.4917 3064.3351 3090.3987 3097.9781 3103.7837 3119.7743 3469.2167
redmass: 2.6391 2.6036 4.4752 3.4757 3.4746 2.5745 1.2113 2.3740 3.1565 3.1973 3.8173 2.1686 2.8523 2.2220 2.7464 3.2727 1.6930 9.2707 5.4834 1.0948 3.0095 1.5749 2.8642 2.3555 2.6318 2.3590 2.5214 1.6945 2.5343 2.3793 2.2053 1.4605 3.1541 2.1313 1.0937 1.6170 1.1327 2.1053 1.2815 1.2418 1.2267 1.3184 1.3846 1.4655 1.2843 2.4579 1.3286 1.0789 1.0785 1.0997 1.0502 1.1041 1.0522 1.0819 10.0065 1.0713 1.0695 1.0686 1.0671 1.0356 1.0582 1.0895 1.0913 1.1066 1.0985 1.0960 1.1026 1.0938 1.0755
irintensity: 0.1377 0.4659 4.7175 1.5962 2.9185 5.7176 2.1466 5.3318 7.5460 2.7480 6.2670 0.3731 1.2220 63.8107 45.5782 12.0094 66.6810 23.6982 14.6584 3.0637 1.6286 0.5449 21.5554 9.5454 9.0624 3.6386 172.2071 1.1739 67.1681 73.2026 21.8068 5.0904 26.2002 8.7434 1.9120 324.8065 0.0603 33.8135 24.2744 37.5544 4.4724 21.5738 2.4819 2.5698 50.4006 106.1092 4.2801 5.9258 3.2985 39.9839 2.4586 2.2359 6.1210 9.5083 409.5068 61.8645 129.9954 28.5817 68.7958 22.0630 27.0734 55.4513 47.5815 9.0580 35.0615 6.4886 50.8406 5.9128 0.5051
temp: 298.150 k
press: 1.00000 atm
elementType: 8 8 7 7 6 6 6 6 6 6 6 1 1 1 1 1 1 1 1 1 1 1 1 1 1
symmnumber: 1
zpe: 560846.5 jmol-1
zpe.correction: 0.213615 hartree
zpe.thermalcorrener: 0.225168 hartree
zpe.thermalcorrenthalpy: 0.226112 hartree
zpe.thermalcorrgfe: 0.175423 hartree
zpe.sumelectzpe: -534.203452 hartree
zpe.sumelectthermal: -534.191900 hartree
zpe.sumelectthermalent: -534.190955 hartree
zpe.sumelectthermalfe: -534.241644 hartree
dipole: -1.0817 -2.5475 -0.6723
dipole: 2.8481
quadrupole: -54.8086 -70.5885 -66.3291
quadrupole: -2.7622 3.2963 1.5815
quadrupole: 9.1002 -6.6798 -2.4204 -2.7622 3.2963 1.5815
hfenergy: -534.4170673 hartree
pointgroup: C01 [X(C7H14N2O2)]
dipole: 0.4496047 0.9860509 -0.284912 debye
dipolederiv: -1.6696814 0.3339013 -0.1130521 0.6633736 -0.6766537 0.0332232 -0.1332626 0.0022337 -0.3051203 -0.8255308 -0.1704134 -0.0558248 -0.2617581 -1.090516 -0.0901677 -0.1067222 -0.1152928 -0.3688716 -1.4379349 -0.2322247 -0.0951752 -0.2447539 -0.6009569 -0.039203 -0.0383631 -0.0175833 -0.3665713 -0.4906387 0.0358336 -0.1513223 0.0393945 -0.5206123 -0.0522117 -0.2417573 -0.079754 -0.5123557 0.0933268 0.1613116 0.040712 0.290976 0.4326671 0.0770871 0.0488061 0.080534 0.3078614 0.4309905 -0.1990848 0.048239 -0.3664502 0.1334677 -0.0531665 0.0323162 -0.060639 0.2737682 0.3915985 -0.2282741 0.1369689 -0.1849266 0.2444711 -0.0349581 0.0600362 0.0081194 0.3184916 0.1498082 0.1369654 0.116142 0.1096494 0.4648125 0.1243355 0.0704692 0.0491536 0.331749 2.4081682 0.2004581 0.2491041 -0.0996086 1.4280605 0.1054343 0.3086029 0.1733928 0.2873277 1.0578281 -0.1120369 0.0711095 0.0340386 0.2462836 -0.0114688 0.1124716 -0.0328989 0.3669078 -0.0721172 0.0994634 -0.0064367 0.0873845 -0.0386027 0.0019031 -0.0115959 0.0035101 0.0653878 0.0288939 -0.0795963 -0.0821175 -0.0807138 -0.0007432 0.0157015 -0.06742 -0.070153 -0.1639904 0.0354392 0.0949583 0.0027411 0.0775552 0.0183633 0.0084497 -0.0111394 0.0235301 0.0939453 0.1129786 -0.0728831 -0.0029771 0.0076541 -0.0331572 -0.0196578 0.006632 -0.0439766 0.0905362 -0.0631839 0.0522043 -0.0547282 0.0547038 0.0888858 -0.0314419 -0.0879481 0.0493502 -0.1572159 -0.065304 0.1007929 -0.0952111 0.0344883 0.0271837 -0.0274107 -0.1038484 0.0936401 -0.2336231 0.0012179 -0.0804729 -0.0122025 -0.0564707 -0.1751225 -0.0363679 -0.0212993 -0.0599083 0.0759646 -0.127764 0.1274131 -0.0066394 0.0970169 -0.0505319 0.0015808 -0.0316366 0.0136126 0.0847919 0.0290204 -0.0900238 -0.1158108 -0.0272562 -0.0458369 -0.0058524 -0.0413547 -0.1061607 -0.2426895 0.0913434 -0.007298 0.1138593 -0.0162705 0.0808761 0.0290416 0.2612969 0.0728704 0.2092887 -0.0520052 0.034596 0.0096901 -0.0470772 0.0207155 -0.0889358 -0.0490247 -0.0840339 -0.094247 -0.0687098 0.0052794 0.004978 -0.0859549 -0.0220582 0.0884787 0.0370245 0.1061483 -0.038369 -0.1741253 -0.0276082 -0.0441554 -0.0529179 0.0673878 -0.0139099 -0.0496795 -0.0092949 0.1054814 0.1199751 -0.0185769 -0.0289348 0.0315854 0.0245755 -0.0834006 0.0062652 -0.1094209 -0.0984027 0.0964064 -0.0646844 0.0710439 -0.0036618 -0.0229587 0.1029171 0.0511309 0.1130212 -0.0300452 unknown
polarizability: 122.5293697|0.3686939|95.3470098|2.1319093|1.4208036|71.2610305 unknown
InChI: InChI=1S/C7H14N2O2/c1-2-11-7(10)9-5-3-8-4-6-9/h8H,2-6H2,1H3
charge 0 multiplicity 1
25 atoms
O  -1.730393 0.340272 0.079715
O  -1.103294 -1.919591 -0.106012
N  0.482772 -0.249089 0.357872
N  3.120792 0.641498 -0.150886
C  0.834661 1.165153 0.605102
C  1.606114 -1.206572 0.439305
C  1.993725 1.583943 -0.325669
C  2.749298 -0.750602 -0.490633
C  -0.789229 -0.712834 0.097182
C  -3.131411 -0.086016 -0.186597
C  -3.981857 1.181269 -0.174099
H  1.165377 1.277336 1.657505
H  -0.053483 1.79062 0.437609
H  1.229796 -2.202434 0.156496
H  1.980927 -1.240834 1.481838
H  1.609611 1.609917 -1.375971
H  2.326946 2.602277 -0.054358
H  3.625218 -1.407072 -0.338953
H  2.407436 -0.862359 -1.549466
H  3.980151 0.952939 -0.61874
H  -3.165589 -0.60632 -1.160977
H  -3.436925 -0.805549 0.594635
H  -5.039906 0.922914 -0.363264
H  -3.917594 1.689498 0.803475
H  -3.651344 1.886037 -0.956609
