program: Gaussian 09
title: 000104590
version: EM64L-G09RevD.01
frameworkgroup: C1[X(C21H32N2O)]
method: RPBEPBE
basis: SDD
operation: Freq
keyword: #p
keyword: freq=noraman
keyword: PBEPBE/SDD
title: #p freq=noraman PBEPBE/SDD
converged: YES YES NO NO
title: Mulliken charges:
elementType: O N N C C C C C C C C C C C C C C C C C C C C C H H H H H H H H H H H H H H H H H H H H H H H H H H H H H H H H
charge: -0.277513 -0.260212 -0.100841 0.299219 0.286856 -0.607303 0.362682 -0.433261 -0.758835 -0.718585 -0.747858 -0.712333 0.202343 0.307884 -0.429791 -0.392749 -0.401683 -0.324306 -0.315576 -0.238692 -0.243568 -0.686997 -0.679288 -0.246258 0.231323 0.215813 0.233349 0.222585 0.242669 0.231097 0.242589 0.217976 0.211166 0.205404 0.283983 0.212331 0.208063 0.210847 0.286566 0.197713 0.236831 0.233537 0.236314 0.175355 0.225311 0.172988 0.206123 0.225043 0.224404 0.251115 0.199012 0.200664 0.239030 0.201072 0.206633 0.229756
chargesum: 0.00000
title: Mulliken charges with hydrogens summed into heavy atoms:
elementType: O N N C C C C C C C C C C C C C C C C C C C C C
charge: -0.277513 -0.260212 -0.100841 0.299219 0.286856 -0.160167 0.362682 -0.199912 -0.062483 -0.046854 -0.046139 -0.006856 0.202343 0.307884 0.004753 -0.159212 -0.165369 0.076359 0.063536 -0.013649 -0.019164 -0.036206 -0.032553 -0.016502
polarizability: 3.46029646e+02 1.71286362e+01 2.32816143e+02 1.47613638e+01 -1.07959829e+01 1.76721319e+02
1716.lowfreq: -13.8407 -0.0009 -0.0006 0.0001 1.7776 6.7487 15.5226 29.5723 37.7585
frequency: 14.5952 29.4248 37.7379 44.2517 51.4134 72.4393 74.9034 83.1614 97.7749 136.3352 145.9787 167.3350 173.3322 184.3477 197.4310 217.3163 221.5819 232.6148 237.3917 247.8984 252.9814 266.1289 279.2396 294.2853 319.2014 323.2069 339.0171 341.2956 361.5535 387.8212 402.0081 404.7915 420.5481 434.2713 456.9512 472.8658 478.1557 492.2685 512.8706 530.3371 568.2112 578.5939 589.6692 616.3694 634.6585 698.9621 717.9439 764.2425 765.1806 794.9886 796.9009 811.8246 818.9657 846.0621 864.6513 865.7467 898.5562 904.1419 913.5862 915.6872 921.1173 925.5582 935.6194 972.9086 976.6383 988.0331 991.6552 993.3738 1001.0608 1005.9462 1018.0346 1025.1500 1039.1331 1055.8166 1073.6412 1080.7023 1085.5930 1089.2453 1110.3535 1132.5465 1144.3000 1156.8853 1163.7074 1171.9372 1173.7048 1194.9107 1196.7759 1214.7983 1233.0752 1264.4259 1269.8442 1272.0155 1284.4507 1292.7838 1305.2386 1311.4916 1318.0173 1344.4013 1359.3642 1363.3591 1367.4538 1371.0936 1376.0683 1378.3969 1382.6590 1384.3902 1385.5959 1398.0064 1436.8912 1445.7491 1446.5990 1455.3525 1461.9167 1463.7721 1464.1443 1466.8637 1468.5609 1470.8971 1478.0970 1483.2289 1484.3033 1485.1310 1487.9230 1490.6385 1499.7277 1514.5057 1566.6148 1581.1725 1611.2195 1679.7679 2823.1121 2839.5555 2854.6779 2967.5911 2981.5547 2982.1274 2983.8666 2984.4810 2987.3777 2992.7645 3034.5685 3040.9206 3047.8002 3053.7160 3070.3275 3072.3129 3073.6933 3076.5125 3078.6756 3081.1558 3093.8144 3095.1752 3101.9527 3115.8723 3116.5513 3119.7828 3121.5323 3125.9276 3126.3517 3139.2835 3147.2488 3164.2002
redmass: 4.0852 3.2495 3.4919 3.5313 3.4083 3.5305 1.9666 3.7108 2.8089 3.4947 2.5451 2.4922 1.9722 1.8785 1.8985 1.4336 1.4286 1.2211 1.1719 1.6624 2.0125 2.0057 2.4342 2.1390 2.2910 2.7346 2.5074 2.2878 2.7221 4.2977 2.6525 2.8266 3.2387 3.0620 3.2582 3.5300 3.0507 3.1977 3.3126 3.3713 2.7425 2.9275 3.6424 6.3990 5.8630 1.7460 3.8508 1.9755 2.0748 1.1949 1.7271 2.9631 3.1774 1.2675 1.6875 2.3115 2.5199 2.3165 1.8828 1.6330 1.6116 1.5142 1.8018 1.4617 1.8065 5.2581 1.9437 1.3257 1.2940 2.2039 1.4031 2.4740 2.2046 2.5238 1.9350 2.5691 1.6052 1.9791 1.8488 1.8669 3.1074 2.3325 2.0343 1.7499 1.3697 1.1393 2.7348 2.3911 2.4964 2.1595 1.5756 1.1885 1.7302 1.2965 2.3182 1.3690 1.4190 1.5313 1.1836 1.9501 1.3413 1.3310 2.1355 1.2269 1.2615 1.8407 1.2596 1.2068 2.3098 1.0842 1.0498 1.0915 1.1026 1.0708 1.0592 1.0519 1.0541 1.0697 1.0504 1.0690 1.0565 1.1388 1.9171 1.0765 1.0713 1.0549 5.6966 5.7406 5.9854 8.0352 1.0725 1.0715 1.0699 1.0643 1.0361 1.0361 1.0362 1.0361 1.0369 1.0381 1.0867 1.0958 1.0882 1.0848 1.0977 1.0996 1.0964 1.0983 1.0991 1.0979 1.0996 1.1000 1.1000 1.0912 1.0978 1.0994 1.0845 1.0920 1.0928 1.0917 1.0963 1.1016
irintensity: 0.0710 0.1143 0.1221 0.0987 0.7160 1.3121 0.5100 0.5883 1.7627 0.4844 0.2122 0.0554 3.5309 1.4800 0.0894 0.5114 0.2928 0.0824 0.1393 0.8276 0.2112 2.0172 0.0734 2.0831 0.7835 1.7752 1.6886 0.9113 2.7074 10.5687 1.4167 0.0469 1.9382 1.1693 6.6802 4.0859 1.7032 1.1228 2.5735 7.0696 5.0896 5.1972 4.8165 0.0654 2.6006 44.0556 16.7351 24.6525 59.0660 3.8398 7.7317 4.0991 1.8399 0.7744 6.1697 6.6799 3.4651 4.7519 1.6391 6.2061 0.8945 0.9254 10.6305 1.8923 28.1830 0.1156 5.8210 0.0551 5.7576 8.6735 16.1776 1.0992 36.6403 2.7635 10.3180 33.8876 11.5590 20.5589 21.7849 13.4117 32.6619 40.0041 48.2152 31.0744 16.2452 1.0770 16.0076 67.7637 25.4219 97.0743 60.6271 5.7569 37.0008 20.0079 68.9988 21.7157 3.2678 31.9969 27.6913 19.7189 0.6265 6.3251 16.3799 28.5030 31.1732 37.9651 17.9607 10.2633 9.7923 10.2766 0.2386 2.0488 6.5255 18.0531 9.7796 0.9256 12.7596 5.5133 4.1335 9.1012 7.0100 11.7061 12.8137 11.6333 27.9328 4.4283 176.6086 4.6278 15.1295 3.0645 73.8539 85.9123 187.5490 17.4258 36.5164 36.1788 35.8469 19.4270 26.1412 21.1711 10.7493 16.1153 8.8710 8.9730 58.9245 25.6334 90.8780 8.5842 45.9160 49.3139 19.3737 28.9642 31.9023 32.4545 17.0768 2.7222 5.9781 4.1780 8.9758 14.4652 42.5824 26.6379
temp: 298.150 k
press: 1.00000 atm
elementType: 8 7 7 6 6 6 6 6 6 6 6 6 6 6 6 6 6 6 6 6 6 6 6 6 1 1 1 1 1 1 1 1 1 1 1 1 1 1 1 1 1 1 1 1 1 1 1 1 1 1 1 1 1 1 1 1
symmnumber: 1
zpe: 1272472.8 jmol-1
zpe.correction: 0.484659 hartree
zpe.thermalcorrener: 0.510816 hartree
zpe.thermalcorrenthalpy: 0.511760 hartree
zpe.thermalcorrgfe: 0.428231 hartree
zpe.sumelectzpe: -1002.273797 hartree
zpe.sumelectthermal: -1002.247641 hartree
zpe.sumelectthermalent: -1002.246697 hartree
zpe.sumelectthermalfe: -1002.330226 hartree
dipole: -2.2787 -2.6358 -1.9254
dipole: 3.9809
quadrupole: -145.1044 -140.5901 -150.9746
quadrupole: -6.5359 -5.6372 -6.3606
quadrupole: 0.4519 4.9663 -5.4182 -6.5359 -5.6372 -6.3606
hfenergy: -1002.7584566 hartree
pointgroup: C01[X(C21H32N2O1)]
dipole: -0.9187165 1.0315249 0.7381645 debye
polarizability: 346.7777385|-16.3675535|232.7291364|-10.6792847|-11.1183454|176.0602332 unknown
InChI: InChI=1S/C21H32N2O/c1-7-22(8-2)16-19(24)23-20(3,4)14-18(15-21(23,5)6)17-12-10-9-11-13-17/h9-14H,7-8,15-16H2,1-6H3
charge 0 multiplicity 1
56 atoms
O  2.637727 -1.290455 -1.004031
N  0.728317 -0.141412 -0.301677
N  4.437844 0.226533 0.428809
C  0.01671 1.113616 0.187193
C  -0.093156 -1.401443 -0.619585
C  -1.407302 1.189844 -0.457172
C  -2.2375 -0.057128 -0.24225
C  -1.569515 -1.238632 -0.299607
C  0.70817 2.428806 -0.277624
C  -0.127345 1.083755 1.734785
C  0.417082 -2.60702 0.228225
C  -0.008421 -1.724462 -2.148683
C  2.125978 -0.284791 -0.419541
C  -3.702317 0.045506 -0.005945
C  3.081305 0.754682 0.23677
C  -4.417037 -0.967203 0.697214
C  -4.437808 1.16731 -0.483378
C  4.522426 -0.869682 1.427688
C  5.441453 1.29871 0.638099
C  -5.809054 -0.871501 0.896278
C  -5.832104 1.265048 -0.283705
C  5.702425 -1.822568 1.158622
C  5.776262 2.082094 -0.64705
C  -6.526941 0.245692 0.405873
H  -1.29013 1.399302 -1.540502
H  -1.907763 2.069717 -0.013463
H  -2.106182 -2.191638 -0.211448
H  -0.033722 3.246492 -0.234698
H  1.54971 2.732478 0.361378
H  1.055329 2.344472 -1.322953
H  -0.745461 0.226719 2.051789
H  0.857177 0.999105 2.226902
H  -0.611131 2.011596 2.093218
H  -0.214476 -3.489517 0.017148
H  1.457665 -2.857889 -0.020709
H  0.339844 -2.378198 1.306979
H  -0.636707 -2.604562 -2.379085
H  -0.38424 -0.871349 -2.741026
H  1.033217 -1.936576 -2.431714
H  2.633893 1.121431 1.194762
H  3.15747 1.625956 -0.435329
H  -3.871071 -1.821654 1.112985
H  -3.922105 1.960036 -1.037082
H  4.581503 -0.466265 2.472122
H  3.590802 -1.457344 1.360354
H  5.125651 2.012919 1.444605
H  6.366914 0.815771 0.999424
H  -6.334648 -1.660795 1.445835
H  -6.376109 2.134851 -0.669144
H  5.599328 -2.24832 0.146528
H  6.67916 -1.308323 1.221073
H  5.71149 -2.646346 1.897256
H  6.104849 1.38371 -1.435586
H  4.90891 2.648198 -1.03427
H  6.585285 2.811216 -0.453548
H  -7.60805 0.322408 0.565693
