program: Gaussian 09
title: 000104529
version: EM64L-G09RevD.01
frameworkgroup: C1[X(C14H8F4O2S)]
method: RPBEPBE
basis: SDD
operation: Freq
keyword: #p
keyword: freq=noraman
keyword: PBEPBE/SDD
title: #p freq=noraman PBEPBE/SDD
converged: YES YES NO NO
title: Mulliken charges:
elementType: S F F F F O O C C C C C C C C C C C C C C H H H H H H H H
charge: 0.293231 -0.163257 -0.158478 -0.162072 -0.202968 -0.410590 -0.219790 -0.346865 0.320272 0.337007 -0.495515 -0.137847 -0.321000 0.264767 -0.142329 0.070928 -0.325198 -0.300878 0.349322 -0.165430 -0.379692 0.299822 0.266936 0.270551 0.306099 0.258022 0.239403 0.262204 0.393344
chargesum: 0.00000
title: Mulliken charges with hydrogens summed into heavy atoms:
elementType: S F F F F O O C C C C C C C C C C C C C C
charge: 0.293231 -0.163257 -0.158478 -0.162072 -0.202968 -0.017246 -0.219790 -0.346865 0.320272 0.337007 -0.195694 0.129090 -0.050448 0.264767 -0.142329 0.070928 -0.019099 -0.042856 0.349322 0.073973 -0.117488
polarizability: 2.39228493e+02 2.13539640e+01 1.60510742e+02 8.69831397e+00 8.86017650e+00 1.39252321e+02
1716.lowfreq: -4.9596 -2.4294 -0.0012 -0.0011 -0.0011 4.9188 8.0297 19.4378 25.2953
frequency: 1.1172 19.3684 25.2694 31.0427 49.0406 78.4460 118.6123 121.2870 150.0875 178.1120 199.3012 218.9997 228.8959 258.5200 287.9236 319.1485 354.4009 376.4138 380.6097 405.0007 414.9163 442.7142 458.7934 488.6112 500.7200 504.0277 533.1603 567.1735 572.0649 603.1986 624.3920 643.4071 660.0937 679.8370 690.8469 713.5465 766.0071 786.4406 817.8888 837.4189 846.1407 881.5720 895.5837 934.8157 971.6144 976.7727 983.4396 990.5766 1006.2976 1028.6231 1030.3341 1057.4759 1070.7055 1088.5378 1138.7684 1164.0320 1169.3520 1188.5996 1255.4846 1270.9398 1279.1698 1314.7114 1375.9455 1379.8314 1403.1312 1415.9045 1455.0856 1465.5784 1569.7732 1587.2379 1594.4045 1611.0581 1645.9247 3147.2559 3156.5270 3166.0938 3169.3377 3175.6905 3178.7418 3183.7868 3513.4292
redmass: 17.1712 7.1583 7.7991 8.1028 11.4599 9.0589 5.6379 9.3681 7.0054 7.1259 10.3549 10.0770 5.3476 12.0894 10.5455 7.7118 7.1219 9.9955 9.2869 4.0429 5.1853 3.5607 8.0404 6.8012 8.8619 9.2508 4.9768 4.6927 1.7224 4.3576 4.1115 6.8222 7.1469 2.5158 6.6802 5.8021 4.5392 1.3869 8.1038 4.9525 1.5425 1.4226 1.3863 1.5679 1.3335 1.3933 5.9760 8.3477 7.6565 5.5952 8.1739 2.0154 2.6679 1.5657 1.9372 1.2845 1.3675 2.5132 1.5717 1.8760 1.5576 2.5414 9.3861 9.3060 4.1290 2.8986 2.3605 2.8522 7.5949 6.5534 7.3994 6.3239 9.4571 1.0874 1.0888 1.0941 1.0928 1.0978 1.0935 1.0983 1.0641
irintensity: 0.0887 0.6577 0.1094 0.8406 1.1572 0.9073 0.3822 1.5242 0.9008 0.4972 1.3025 5.3084 2.3511 1.4511 2.3667 0.4950 3.5636 6.0388 1.8653 3.5595 2.3923 8.9854 8.9577 7.5299 7.3528 4.1568 2.4529 19.4111 78.6523 39.7616 37.8158 12.7201 2.0235 26.9549 3.8756 20.7683 2.4587 59.3261 25.1495 31.5474 72.4004 18.7881 2.7902 66.6691 0.6589 2.2596 4.8750 194.1769 30.2479 7.1668 157.7638 49.1589 317.9670 17.0307 32.9726 15.3565 56.3479 30.3434 104.0330 166.5574 75.4762 37.8569 3.0886 0.5019 7.6086 18.3535 77.7144 4.7690 10.5705 66.2543 79.1835 44.5550 314.2200 5.9098 0.3324 5.9073 1.3654 1.7481 5.3294 7.4248 42.7134
temp: 298.150 k
press: 1.00000 atm
elementType: 16 9 9 9 9 8 8 6 6 6 6 6 6 6 6 6 6 6 6 6 6 1 1 1 1 1 1 1 1
symmnumber: 1
zpe: 489542.6 jmol-1
zpe.correction: 0.186457 hartree
zpe.thermalcorrener: 0.205421 hartree
zpe.thermalcorrenthalpy: 0.206365 hartree
zpe.thermalcorrgfe: 0.132688 hartree
zpe.sumelectzpe: -1484.688700 hartree
zpe.sumelectthermal: -1484.669736 hartree
zpe.sumelectthermalent: -1484.668791 hartree
zpe.sumelectthermalfe: -1484.742468 hartree
dipole: -4.3879 -1.0959 -1.8265
dipole: 4.8776
quadrupole: -132.0481 -125.1199 -127.2365
quadrupole: 2.9553 4.9535 9.9728
quadrupole: -3.9133 3.0149 0.8983 2.9553 4.9535 9.9728
hfenergy: -1484.8751567 hartree
pointgroup: C01 [X(C14H8F4O2S1)]
dipole: 1.7421954 0.3168917 -0.7395273 debye
polarizability: 240.9647168|17.1710195|157.8715234|-10.2156685|-9.3850037|140.1553155 unknown
InChI: InChI=1S/C14H8F4O2S/c15-9-2-1-3-10(7-9)21-12-5-4-8(14(16,17)18)6-11(12)13(19)20/h1-7,19H
charge 0 multiplicity 1
29 atoms
S  1.368275 -1.205631 -1.592223
F  -4.598951 1.956365 -0.885088
F  -4.972098 0.245352 0.563618
F  -3.917736 2.125011 1.265932
F  3.688897 0.853747 2.644489
O  0.476362 -2.645285 1.054159
O  -1.603073 -3.5265 0.511143
C  -0.176261 -0.463008 -0.896328
C  -2.694691 0.618066 -0.200928
C  -1.079631 -1.22119 -0.104145
C  -2.354651 -0.684032 0.209049
C  -0.532765 0.844966 -1.303936
C  -1.774414 1.398044 -0.943301
C  -4.022369 1.21345 0.176341
C  2.658001 -0.186648 -0.745145
C  -0.789195 -2.577862 0.464554
C  2.650033 -0.048831 0.661916
C  3.686638 0.383974 -1.530835
C  3.68636 0.698705 1.24416
C  4.723099 1.109552 -0.897202
C  4.730507 1.283775 0.504894
H  -3.062584 -1.294915 0.777046
H  0.164217 1.417343 -1.922744
H  -2.041584 2.409013 -1.265642
H  1.883621 -0.524423 1.279702
H  3.673481 0.269683 -2.618935
H  5.521949 1.551816 -1.501061
H  5.514597 1.85049 1.014482
H  0.626764 -3.562127 1.41293
