program: Gaussian 09
title: 000148981
version: EM64L-G09RevD.01
frameworkgroup: C1[X(C25H28N3)]
method: RPBEPBE
basis: SDD
operation: Freq
keyword: #p
keyword: freq=noraman
keyword: PBEPBE/SDD
title: #p freq=noraman PBEPBE/SDD
converged: YES YES NO NO
title: Mulliken charges:
elementType: N N N C C C C C C C C C C C C C C C C C C C C C C C C C H H H H H H H H H H H H H H H H H H H H H H H H H H H H
charge: -0.195051 -0.153799 -0.161049 0.259046 0.040413 0.278568 0.269981 0.331384 -0.380082 -0.543565 -0.554636 0.204346 -0.389548 -0.393126 0.414794 0.423962 -0.396342 -0.375509 -0.668978 -0.364026 -0.355856 -0.224212 -0.221914 -0.635572 -0.645451 -0.637640 -0.645279 -0.227576 0.243128 0.275330 0.268831 0.273472 0.232544 0.234525 0.260949 0.259643 0.246389 0.245322 0.246507 0.257510 0.258389 0.249818 0.250448 0.246296 0.246369 0.236253 0.240938 0.241516 0.239040 0.235727 0.242845 0.242751 0.242275 0.236613 0.241677 0.251616
chargesum: 1.00000
title: Mulliken charges with hydrogens summed into heavy atoms:
elementType: N N N C C C C C C C C C C C C C C C C C C C C C C C C C
charge: -0.195051 -0.153799 -0.161049 0.259046 0.040413 0.278568 0.269981 0.331384 0.138376 -0.274734 -0.281165 0.204346 -0.157004 -0.158601 0.414794 0.423962 -0.135393 -0.115866 0.069239 -0.106516 -0.097466 0.025606 0.028533 0.093345 0.076044 0.083682 0.075286 0.024040
polarizability: 5.40885171e+02 -9.58677380e-01 3.36855709e+02 -1.46422138e+00 1.09557409e+00 1.74705994e+02
1716.lowfreq: -8.1998 -6.5509 -0.0002 0.0005 0.0010 3.1932 27.2022 29.4260 42.1035
frequency: 27.1895 29.3879 42.0813 47.9211 56.7853 57.3938 75.9933 86.0182 103.2763 107.2667 121.7155 125.0732 139.7699 164.5148 177.4828 184.2112 193.6922 202.7205 216.0647 220.6601 230.2042 240.0143 258.2060 276.3508 308.6791 317.8426 351.2978 383.4105 390.0593 397.7582 407.6086 438.3771 455.3239 464.2605 469.6599 506.1114 509.9272 516.9429 538.6127 556.9104 575.4865 610.5435 613.7559 630.4870 648.6995 652.7770 687.6420 697.7604 699.1594 712.9314 717.8366 766.2953 770.7866 792.8767 798.5841 822.1458 827.2023 836.9149 851.9359 866.1918 868.1554 904.4546 938.5535 956.3939 963.2070 971.1141 975.0650 976.8630 987.0889 988.5284 1004.0210 1011.2866 1024.9306 1042.7224 1052.7752 1053.9341 1081.9132 1088.2369 1100.3934 1102.0050 1112.5592 1113.4264 1121.0084 1127.1122 1162.4832 1166.3845 1175.0908 1181.1282 1192.6451 1197.6742 1227.5336 1251.9820 1253.1896 1262.9427 1279.3416 1296.2780 1313.9091 1338.8223 1350.1034 1353.1796 1367.0582 1370.1635 1376.3794 1389.5022 1398.5555 1404.4588 1430.1139 1431.2207 1432.1056 1441.3329 1448.6810 1458.9880 1460.8771 1466.6286 1468.2357 1470.9216 1474.4870 1482.2734 1482.8050 1484.2590 1486.3723 1487.5956 1491.0489 1499.6432 1505.3180 1507.6500 1522.2139 1528.2797 1553.1922 1562.9494 1580.9095 1606.4428 1631.8672 1641.2000 2952.8495 2953.2743 2964.0033 2968.9434 3002.6938 3022.3695 3022.8609 3035.5605 3042.8235 3049.8335 3099.1565 3101.5738 3112.2126 3116.1895 3122.4878 3124.9162 3125.6502 3134.0662 3135.0712 3149.4677 3156.1649 3160.3576 3164.3708 3175.8505 3180.2278 3185.3107 3193.6338 3215.7464
redmass: 3.6482 3.7213 3.6253 2.7139 4.1766 3.0826 3.0967 2.7104 3.8863 2.3449 1.6118 1.5460 1.7442 1.9154 1.6878 2.9044 1.3726 1.1861 3.8419 2.5003 2.9810 3.8669 3.8681 3.2293 3.3008 3.8582 3.0099 3.4361 3.9998 2.8382 4.3911 3.7252 3.5213 3.1229 3.2664 3.6547 3.6664 3.7800 3.5265 5.2395 3.1976 5.8630 4.1114 4.2697 5.2167 5.2293 6.4670 4.8278 4.0882 1.8085 2.9430 2.2193 2.2426 2.6059 1.5267 1.5436 1.9782 2.0059 1.8149 1.4013 2.9210 3.8189 1.4280 2.9372 1.3901 3.9106 3.1387 1.3471 4.7340 1.4883 2.6060 1.3355 2.5375 2.9479 1.5356 1.5478 1.6464 1.9632 1.2359 1.2370 1.3353 1.3378 1.8261 2.9838 1.6736 1.7556 1.8127 1.0549 1.1210 1.5996 1.9230 2.7763 3.0501 1.5115 1.4683 1.6188 1.4049 2.1745 1.5344 1.8718 6.1085 3.4590 3.1843 3.2082 1.2933 3.3114 2.1651 1.2012 1.1637 2.4626 3.2916 1.4542 1.5376 1.0399 1.0402 1.0575 1.8831 1.0447 1.0452 1.8969 1.0643 1.1340 1.6072 1.3644 1.1096 1.2026 2.1562 5.5482 5.6902 5.0740 5.8080 6.0022 5.7130 6.1714 1.0382 1.0376 1.0387 1.0383 1.0362 1.1011 1.1010 1.1024 1.1023 1.0657 1.0982 1.0998 1.0969 1.0967 1.0949 1.1006 1.0949 1.0883 1.0886 1.0915 1.0879 1.0962 1.0862 1.1016 1.0957 1.0958 1.0903 1.0892
irintensity: 0.4307 0.2598 0.8020 0.2347 0.1823 0.6299 0.1590 1.2113 1.8961 0.4289 1.8572 4.3539 0.5135 0.8270 1.5721 1.2195 0.0749 0.3358 0.1672 0.6164 0.8781 0.1865 0.6124 0.7564 8.9710 1.5417 0.2132 0.6698 0.0353 0.0121 3.4919 2.1291 0.8478 2.3539 1.0766 5.4648 2.7567 3.4354 3.1151 1.5242 1.1415 1.3996 7.6566 5.4927 0.3606 4.3456 1.4894 1.7155 10.5862 34.5836 6.7578 7.7438 27.6682 21.3422 2.7371 13.4573 52.4002 46.5913 6.0818 3.9120 21.7844 2.9636 1.1043 10.0244 0.0084 1.2152 1.1958 0.0225 8.3614 0.8915 41.0080 0.9550 16.9585 3.4447 21.0602 18.2848 10.6372 17.9616 0.0319 0.0004 0.5674 0.6881 11.1254 10.6161 4.8226 0.0077 15.7724 0.0051 2.8659 21.0632 36.7486 63.2050 35.3939 3.0348 8.4757 102.6571 0.9637 157.3707 14.7909 52.7522 0.2586 55.5972 41.8906 45.0194 22.5781 12.9317 12.9236 1.1933 20.3417 151.1754 23.8778 4.5386 118.7095 2.0921 0.0364 3.9256 4.5735 29.6910 27.7969 14.3590 4.2294 1.1403 0.4205 9.4869 42.5495 2.0708 841.5988 9.1879 20.6013 24.4654 2.1897 1.1305 158.3933 575.3492 53.4823 76.5984 100.3190 102.2890 12.0824 27.7643 24.3064 35.8456 30.6009 10.2384 9.7405 14.8222 2.9750 2.7844 32.0702 10.7432 26.8783 2.1999 1.1151 2.9267 2.9937 12.2840 0.5459 13.8132 5.0098 15.0415 5.9545 4.8255
temp: 298.150 k
press: 1.00000 atm
elementType: 7 7 7 6 6 6 6 6 6 6 6 6 6 6 6 6 6 6 6 6 6 6 6 6 6 6 6 6 1 1 1 1 1 1 1 1 1 1 1 1 1 1 1 1 1 1 1 1 1 1 1 1 1 1 1 1
symmnumber: 1
zpe: 1235482.9 jmol-1
zpe.correction: 0.470571 hartree
zpe.thermalcorrener: 0.497331 hartree
zpe.thermalcorrenthalpy: 0.498275 hartree
zpe.thermalcorrgfe: 0.413103 hartree
zpe.sumelectzpe: -1131.526839 hartree
zpe.sumelectthermal: -1131.500078 hartree
zpe.sumelectthermalent: -1131.499134 hartree
zpe.sumelectthermalfe: -1131.584306 hartree
dipole: -1.4439 0.2576 0.0009
dipole: 1.4667
quadrupole: -57.0378 -113.8357 -162.2433
quadrupole: -4.7295 -0.8653 0.7440
quadrupole: 54.0012 -2.7968 -51.2044 -4.7295 -0.8653 0.7440
hfenergy: -1131.9974094 hartree
pointgroup: C01 [X(C25H28N3)]
dipole: -0.567222 0.1058862 -0.0035059 debye
polarizability: 540.8560981|-2.6597392|336.7460967|-1.3916244|-4.8637361|174.8446789 unknown
InChI: InChI=1S/C25H28N3/c1-6-28-24-17-20(27(4)5)13-15-22(24)21-14-12-19(26(2)3)16-23(21)25(28)18-10-8-7-9-11-18/h7-17H,6H2,1-5H3
charge 1 multiplicity 1
56 atoms
N  -0.794937 1.112293 0.048705
N  -5.521909 -0.265619 0.118148
N  4.259177 -2.430779 0.006929
C  -1.792171 0.091994 0.057558
C  0.549332 0.826669 0.044442
C  1.016209 -0.531566 0.042072
C  -1.360171 -1.282681 0.063708
C  0.044675 -1.603752 0.049308
C  -1.242032 2.548759 0.012524
C  -3.169462 0.426399 0.068746
C  2.416963 -0.808459 0.029154
C  1.536463 1.955997 0.050441
C  -2.387936 -2.279569 0.085533
C  0.554347 -2.939592 0.042906
C  -4.172849 -0.583031 0.097449
C  2.90328 -2.140099 0.022149
C  -3.73795 -1.959566 0.103355
C  1.919686 -3.202965 0.029555
C  -1.650149 3.006038 -1.401403
C  2.031116 2.485047 -1.169721
C  2.03233 2.456804 1.28323
C  2.991744 3.521326 -1.155303
C  2.990816 3.494492 1.292517
C  -6.544741 -1.3297 0.138488
C  -5.947666 1.143409 0.118976
C  4.732727 -3.827335 -0.007297
C  5.238272 -1.331841 -0.004925
C  3.469593 4.031001 0.074237
H  -2.066165 2.661249 0.735613
H  -0.407949 3.164255 0.376217
H  -3.482084 1.468039 0.047887
H  3.109994 0.033314 0.022222
H  -2.10875 -3.336247 0.092711
H  -0.132943 -3.789595 0.046958
H  -4.473192 -2.767149 0.122845
H  2.250287 -4.24497 0.023786
H  -0.779918 3.004102 -2.079127
H  -2.03584 4.039422 -1.351607
H  -2.432864 2.365546 -1.840192
H  1.678463 2.078737 -2.124539
H  1.671335 2.034875 2.228099
H  3.367213 3.926008 -2.100844
H  3.364278 3.879552 2.246984
H  -6.453587 -1.967481 1.038489
H  -6.483441 -1.973798 -0.759572
H  -7.543816 -0.870057 0.153723
H  -5.555805 1.685633 1.002602
H  -7.045531 1.195532 0.152736
H  -5.611595 1.67242 -0.795413
H  5.832624 -3.834712 -0.015757
H  4.400627 -4.383824 0.890557
H  4.386055 -4.371029 -0.907629
H  5.139211 -0.689604 0.892745
H  6.256927 -1.746729 -0.013767
H  5.121899 -0.692763 -0.902986
H  4.212307 4.835399 0.083376
