program: Gaussian 09
title: 000146471
version: EM64L-G09RevD.01
frameworkgroup: C1[X(C3H6O4S)]
method: RPBEPBE
basis: SDD
operation: Freq
keyword: #pfreq=noraman
keyword: PBEPBE/SDD
title: #p freq=noraman PBEPBE/SDD
converged: YES YES NO NO
title: Mulliken charges:
elementType: S O O O O C C C H H H H H H
charge: 1.195832 -0.430508 -0.540623 -0.449333 -0.472182 -0.342802 -0.031874 -0.514174 0.243795 0.237025 0.244940 0.399911 0.232659 0.227333
chargesum: 0.00000
title: Mulliken charges with hydrogens summed into heavy atoms:
elementType: S O O O O C C C
charge: 1.195832 -0.430508 -0.140712 -0.449333 -0.472182 0.138018 0.213066 -0.054182
polarizability: 1.21551726e+02 6.47401677e+00 5.91794093e+01 8.83539961e+00 3.07079721e-01 6.38908367e+01
1716.lowfreq: -11.3702 -5.0281 -0.0030 -0.0026 0.0017 5.6343 29.9737 40.3739 79.9312
frequency: 29.9425 40.1458 79.9081 112.8204 148.0370 217.5978 236.6575 284.4652 315.9324 342.4208 386.9980 422.0700 518.0332 572.1365 641.8058 863.5514 882.1450 925.9409 966.8651 974.7382 991.3187 1006.4944 1107.9097 1141.9004 1204.7322 1286.8499 1332.5734 1427.4227 1473.1203 1648.1076 2996.8613 3076.7521 3097.5778 3139.4931 3208.9962 3457.6789
redmass: 6.0068 2.6554 4.0439 2.4947 2.3321 6.6777 3.4452 2.1183 10.5877 9.3389 6.3929 2.3937 4.6504 14.0184 1.9095 11.3294 5.6132 1.4127 1.8257 1.3282 11.3385 1.2015 1.2321 1.5635 1.2988 1.2239 1.2311 1.1803 1.1040 4.4480 1.0572 1.1074 1.0609 1.0952 1.1149 1.0656
irintensity: 0.2416 0.8122 10.1077 22.8973 47.6667 4.9995 11.8697 48.8690 17.1531 9.9552 35.6987 1.5302 66.8156 132.3065 2.1660 109.5953 123.9998 21.1294 28.7805 67.0082 97.0789 14.6241 97.0339 1.7694 1.4013 2.1319 5.8347 23.5745 13.5993 5.7966 26.7057 11.3923 6.5153 10.4228 17.9874 61.7829
temp: 298.150 k
press: 1.00000 atm
elementType: 16 8 8 8 8 6 6 6 1 1 1 1 1 1
symmnumber: 1
zpe: 242602.7 jmol-1
zpe.correction: 0.092402 hartree
zpe.thermalcorrener: 0.102908 hartree
zpe.thermalcorrenthalpy: 0.103852 hartree
zpe.thermalcorrgfe: 0.054789 hartree
zpe.sumelectzpe: -815.992844 hartree
zpe.sumelectthermal: -815.982338 hartree
zpe.sumelectthermalent: -815.981394 hartree
zpe.sumelectthermalfe: -816.030457 hartree
dipole: 5.2497 0.8204 0.4829
dipole: 5.3353
quadrupole: -54.9489 -53.9211 -57.8587
quadrupole: -0.8372 -0.6704 2.0061
quadrupole: 0.6273 1.6551 -2.2824 -0.8372 -0.6704 2.0061
hfenergy: -816.0852465 hartree
pointgroup: C01 [X(C3H6O4S1)]
dipole: 2.0458322 -0.4117385 0.2261221 debye
dipolederiv: 1.8972374 -0.0476964 -0.0354722 -0.0119143 1.5238479 -0.0962656 0.2005752 -0.129539 1.6103326 -0.7820275 -0.0411156 0.1307191 -0.0778011 -0.4394706 0.0173031 0.131504 0.0109078 -0.4830523 -0.4257461 -0.0355441 -0.0239588 -0.3089086 -0.6869029 0.2142762 0.2638535 0.1829024 -0.8084329 -0.6342577 0.0851906 -0.0203756 0.1975608 -0.5562763 -0.0015213 -0.0399196 -0.0276011 -0.4428323 -0.5852775 0.0320451 -0.0007495 -0.0805421 -0.4995537 -0.1111161 -0.1873486 -0.0453949 -0.5957657 0.7126766 -0.0487354 -0.1150638 0.2269866 0.2945562 -0.0390173 -0.6561572 -0.1015138 0.3260765 -0.3670393 -0.0322013 0.1001116 0.1390335 0.0082893 0.1561564 0.3870562 0.1881836 -0.045651 -0.0203966 -0.0275082 0.1431787 -0.2715856 -0.0654545 0.1678246 0.1151472 0.1676523 -0.1200083 -0.0011375 -0.006328 0.0043434 -0.0108597 -0.0181301 -0.1105034 0.0721386 -0.0544169 -0.0153059 -0.0488535 0.0782002 -0.0285157 -0.0161726 -0.0620326 0.0955523 0.0732296 0.0566216 0.0347076 0.0750795 0.0255281 -0.0353479 0.0018013 0.0129956 -0.1113714 -0.0986451 -0.1028772 0.0471507 0.0829024 0.0223061 0.053012 0.156095 0.3453177 -0.0181824 -0.0754808 0.0332802 0.3402299 -0.0004901 0.0129336 -0.1089581 0.0724786 0.1196107 -0.0478292 -0.169995 -0.0449055 0.0961061 0.09733 -0.0170747 -0.0629232 -0.0161718 0.0232033 -0.1153061 -0.015958 -0.1332995 0.0564448 unknown
polarizability: 120.3802837|-13.4752348|64.2543795|2.5562769|1.4930361|59.9873086 unknown
InChI: InChI=1S/C3H6O4S/c1-2-3-7-8(4,5)6/h2,4H,1,3H2
charge 0 multiplicity 1
14 atoms
S  -1.621319 0.134276 -0.121023
O  0.132499 0.098887 0.51761
O  -2.195064 -0.807039 1.324715
O  -2.294558 1.581899 -0.044514
O  -1.701367 -0.729139 -1.47402
C  1.184752 0.350579 -0.525349
C  2.464397 0.379567 0.266409
C  3.444976 -0.549651 0.132321
H  1.169836 -0.461396 -1.273241
H  0.982933 1.324025 -1.011706
H  2.569548 1.208662 0.976853
H  -1.380264 -1.270048 1.683665
H  4.37478 -0.483275 0.707703
H  3.350551 -1.393446 -0.561922
