program: Gaussian 09
title: 000144778
version: EM64L-G09RevD.01
frameworkgroup: C1[X(C18H18O4)]
method: RPBEPBE
basis: SDD
operation: Freq
keyword: #pfreq=noraman
keyword: PBEPBE/SDD
title: #p freq=noraman PBEPBE/SDD
converged: YES YES NO NO
title: Mulliken charges:
elementType: O O O O C C C C C C C C C C C C C C C C C C H H H H H H H H H H H H H H H H H H
charge: -0.249888 -0.315321 -0.266762 -0.254160 0.363979 0.214306 -0.274611 -0.491270 -0.349085 -0.367758 -0.344914 -0.306981 0.376820 0.147590 -0.389725 -0.316212 0.317913 -0.323117 -0.338141 -0.000466 -0.577568 -0.537640 0.219191 0.208230 0.203052 0.229550 0.251080 0.255619 0.266668 0.267240 0.252507 0.303256 0.253169 0.241567 0.207423 0.219243 0.216746 0.221771 0.221855 0.244848
chargesum: 0.00000
title: Mulliken charges with hydrogens summed into heavy atoms:
elementType: O O O O C C C C C C C C C C C C C C C C C C
charge: -0.249888 -0.315321 -0.266762 -0.254160 0.363979 0.214306 0.152809 -0.058669 -0.098005 -0.112140 -0.078246 -0.039741 0.376820 0.147590 -0.137218 -0.012955 0.317913 -0.069948 -0.096574 0.206956 -0.141579 0.150834
polarizability: 3.99509561e+02 2.08674966e+00 2.05329745e+02 -7.29503381e+00 -9.94644592e+00 1.06000317e+02
1716.lowfreq: -6.5177 -1.7836 -0.0012 -0.0002 0.0011 2.2007 16.0440 21.7894 33.1630
frequency: 16.0291 21.6319 33.0898 36.8546 53.4853 56.7043 72.2812 94.7562 109.2537 126.2616 142.4844 153.9626 174.8027 222.7734 237.0691 259.6599 280.1653 298.5909 320.9146 358.8906 375.0249 392.1836 416.2424 418.4640 437.5510 454.8259 494.8477 504.5166 518.3665 531.2947 611.3263 624.8712 628.5750 640.0356 666.3351 714.7185 715.2027 751.3647 757.1267 789.5474 813.1946 824.5951 826.5401 833.0232 850.5923 856.6104 892.1083 946.8022 950.2515 962.9811 968.4959 976.9725 986.0959 987.6938 990.6688 995.3229 999.2397 1004.1717 1038.3893 1067.4809 1108.0961 1113.7774 1117.8926 1137.7537 1150.1688 1158.3751 1170.1821 1184.4262 1220.7597 1230.3560 1233.5529 1238.5888 1249.4336 1289.1832 1293.7788 1300.9429 1331.8054 1367.9845 1375.5268 1381.3202 1421.0690 1427.6608 1430.6572 1436.6973 1444.9914 1466.5708 1471.9458 1474.1959 1487.6120 1496.9375 1570.2648 1586.5963 1612.7217 1618.6474 1621.5827 1666.3579 2954.2022 2959.1134 2970.9512 3019.1572 3046.7045 3054.3363 3078.1307 3095.8043 3124.6522 3150.2386 3156.1190 3160.2698 3162.1021 3171.2695 3177.6858 3186.2442 3199.3455 3211.4120
redmass: 4.2054 3.9563 5.1980 4.9303 3.7708 3.5969 3.6986 4.3412 3.5533 4.6259 5.0453 4.0721 3.9831 3.6205 1.2499 3.7833 3.3359 6.3782 4.1554 3.4976 6.6369 3.5829 2.9912 3.1087 3.2899 3.2390 4.0590 2.9759 2.5164 5.6532 3.4049 4.7100 5.8996 2.2262 4.4104 4.8948 4.3316 4.4639 5.4702 6.4925 1.2544 1.3320 6.4947 1.6470 1.6741 1.9677 2.7187 1.3553 1.3387 1.3228 1.4252 1.3840 1.3711 8.5031 1.4271 3.4236 2.6921 1.6934 3.7883 2.4630 1.2775 1.2594 1.3047 1.6810 1.6824 1.6307 1.2522 1.5394 1.4612 1.9045 3.2998 1.6135 4.0327 1.2161 1.2783 1.2928 1.3784 1.6089 6.1264 3.3029 3.8715 1.1656 4.3394 1.1789 1.1216 1.0497 1.1214 1.1736 2.1274 2.2673 7.8150 7.9101 8.0310 6.8513 7.4608 4.8137 1.0561 1.0330 1.0650 1.1069 1.1040 1.0936 1.0792 1.0758 1.0994 1.0881 1.0882 1.0900 1.0888 1.0956 1.0974 1.0966 1.1146 1.0942
irintensity: 1.1966 0.0295 0.7647 0.3483 0.6401 0.4283 0.0977 4.6518 2.0167 3.5196 0.3742 1.7675 7.9848 1.6524 1.1386 0.4201 1.0464 0.2044 2.4292 7.8039 0.1247 1.0060 0.0473 0.1878 6.6669 0.6809 7.9888 4.4805 23.9936 24.5293 4.7703 1.7269 1.7797 45.0381 24.6637 9.3569 6.2760 12.1380 0.7649 12.5895 2.4207 8.2579 5.8373 85.4899 51.7347 21.8820 84.3761 54.5207 2.1635 1.8417 46.5185 11.1003 8.8020 28.0240 83.8866 24.9746 73.4617 1.4816 356.6181 36.2080 18.5283 0.2207 16.7811 14.2018 265.6827 298.3379 412.2472 124.2407 29.3836 24.8065 89.9015 36.8886 551.7854 0.7945 4.3206 1.3813 0.2055 2.3831 6.3266 48.1469 3.4203 5.8324 4.7466 30.0529 22.2800 13.4260 136.5192 52.6648 197.5673 80.4024 6.4587 7.5527 155.4687 187.7874 143.8898 12.5065 21.7848 77.3587 51.3502 38.2287 49.9056 9.8646 36.9247 5.7313 28.2707 3.5649 8.6664 12.6382 2.7323 15.9704 4.6815 3.5057 27.2206 5.3224
temp: 298.150 k
press: 1.00000 atm
elementType: 8 8 8 8 6 6 6 6 6 6 6 6 6 6 6 6 6 6 6 6 6 6 1 1 1 1 1 1 1 1 1 1 1 1 1 1 1 1 1 1
symmnumber: 1
zpe: 825719.2 jmol-1
zpe.correction: 0.314500 hartree
zpe.thermalcorrener: 0.335652 hartree
zpe.thermalcorrenthalpy: 0.336597 hartree
zpe.thermalcorrgfe: 0.260886 hartree
zpe.sumelectzpe: -995.976727 hartree
zpe.sumelectthermal: -995.955575 hartree
zpe.sumelectthermalent: -995.954630 hartree
zpe.sumelectthermalfe: -996.030341 hartree
dipole: 1.8377 -1.0473 0.0245
dipole: 2.1154
quadrupole: -87.5646 -123.8977 -131.7147
quadrupole: -1.0774 -2.9087 -1.4562
quadrupole: 26.8277 -9.5054 -17.3224 -1.0774 -2.9087 -1.4562
hfenergy: -996.2912271 hartree
pointgroup: C01 [X(C18H18O4)]
dipole: -0.7271823 -0.4032895 0.0345463 debye
polarizability: 399.5105382|-3.9623332|205.612584|5.9365577|-8.7806477|105.7165011 unknown
InChI: InChI=1S/C18H18O4/c1-3-4-13-21-16-7-5-14(6-8-16)18(19)22-17-11-9-15(20-2)10-12-17/h3,5-12H,1,4,13H2,2H3
charge 0 multiplicity 1
40 atoms
O  -4.748269 0.389692 0.18053
O  1.612584 0.277819 0.190709
O  7.206343 0.968991 0.147147
O  1.276732 -2.053911 0.274652
C  -3.406321 0.008779 0.196752
C  -0.625329 -0.535124 0.219819
C  -5.776416 -0.66914 0.20975
C  -7.144967 0.020787 0.131316
C  -2.950543 -1.33578 0.254324
C  -2.471638 1.077772 0.152367
C  -1.567365 -1.594375 0.264538
C  -1.096099 0.807416 0.164156
C  3.039867 0.297405 0.18599
C  0.816302 -0.885743 0.232358
C  3.579127 1.606876 0.152148
C  3.889582 -0.830645 0.207708
C  5.834512 0.669672 0.16181
C  4.969541 1.794347 0.140215
C  5.291339 -0.636741 0.195265
C  -7.411261 0.686996 -1.20346
C  -7.808252 1.972023 -1.367595
C  8.141913 -0.157391 0.172705
H  -5.680462 -1.247692 1.151062
H  -5.627304 -1.354768 -0.650224
H  -7.910508 -0.763649 0.312688
H  -7.230425 0.754789 0.95284
H  -3.654321 -2.171839 0.292163
H  -2.853076 2.101971 0.106552
H  -1.193427 -2.622718 0.307838
H  -0.3723 1.625281 0.129067
H  2.896509 2.461632 0.135491
H  3.469481 -1.836022 0.235023
H  5.407452 2.796265 0.11419
H  5.939069 -1.51807 0.212315
H  -7.273982 0.049671 -2.091897
H  -7.94422 2.645029 -0.512038
H  -7.999738 2.391257 -2.361572
H  8.015518 -0.806651 -0.715708
H  8.020306 -0.761175 1.093227
H  9.142247 0.299562 0.158379
