program: Gaussian 09
title: 000063279
version: EM64L-G09RevD.01
frameworkgroup: C1[X(C18H17N3O3)]
method: RPBEPBE
basis: SDD
operation: Freq
keyword: #p
keyword: freq=noraman
keyword: PBEPBE/SDD
title: #p freq=noraman PBEPBE/SDD
converged: YES YES NO NO
title: Mulliken charges:
elementType: O O O N N N C C C C C C C C C C C C C C C C C C H H H H H H H H H H H H H H H H H
charge: -0.262034 -0.243265 -0.244376 -0.349760 -0.011764 -0.698134 0.313437 0.084823 0.228284 0.100690 0.009819 0.354912 -0.402436 -0.550324 -0.310166 -0.337305 0.534728 -0.400243 -0.408473 -0.828406 -0.249584 -0.229724 0.319542 -0.754793 0.269614 0.260696 0.267318 0.258655 0.257833 0.234160 0.224160 0.225905 0.274759 0.229478 0.230158 0.227824 0.316696 0.310733 0.248377 0.250174 0.248012
chargesum: 0.00000
title: Mulliken charges with hydrogens summed into heavy atoms:
elementType: O O O N N N C C C C C C C C C C C C C C C C C C
charge: -0.262034 -0.243265 -0.244376 -0.349760 -0.011764 -0.070705 0.313437 0.084823 0.228284 0.100690 0.009819 0.354912 0.127874 -0.283006 -0.051511 -0.079472 0.534728 -0.166083 -0.184313 -0.098264 -0.019426 -0.001900 0.319542 -0.008229
polarizability: 3.60319471e+02 1.77644519e+01 2.11699487e+02 -1.45895381e+00 -7.11872582e+00 1.57632821e+02
1716.lowfreq: -13.4185 -4.3658 -0.0008 -0.0006 -0.0004 4.1136 8.6516 30.6500 35.6257
frequency: 7.2801 30.3245 35.4183 38.9466 48.0926 52.5740 68.7638 99.6946 136.2417 140.7285 161.1378 164.7365 178.4754 190.4042 217.5533 226.7635 231.4307 303.7067 319.1861 335.1895 366.6790 377.8322 383.5636 416.5653 423.4885 428.9220 455.2551 459.7014 480.7309 514.1230 531.7597 543.8882 556.8291 566.6865 578.4393 585.8507 621.0574 649.5668 679.5851 691.2267 709.7952 721.2581 751.0681 776.9105 789.9193 798.3277 836.8976 842.9146 854.9092 872.5642 907.5738 913.8005 926.9820 950.8620 967.4102 981.8193 988.4295 990.2337 994.8767 1011.4441 1035.0859 1042.7015 1044.7568 1048.1186 1077.8070 1115.5589 1131.4195 1174.5885 1183.0573 1192.0457 1195.3131 1210.3484 1231.9935 1254.8262 1282.7649 1288.6051 1307.5810 1339.1954 1358.8511 1373.8380 1381.9139 1397.6416 1403.7728 1433.3939 1447.7505 1453.8843 1457.4354 1462.8301 1466.8965 1477.5036 1485.5350 1494.3835 1547.9676 1560.1889 1589.7605 1606.9011 1614.1273 1636.6126 1647.7353 1650.4132 2979.1931 3004.7571 3035.0731 3058.5945 3091.3995 3099.6737 3115.8291 3124.9968 3125.4187 3138.0625 3140.1927 3142.5132 3155.4795 3167.0627 3171.1139 3564.3007 3704.5590
redmass: 7.1671 5.4362 5.2516 4.3662 1.0279 3.8136 5.1001 5.1416 1.1643 4.3850 5.3294 5.6266 3.0914 6.9788 4.5831 3.9435 5.8364 3.0500 3.5805 3.8748 3.9896 3.5490 1.1514 1.4681 2.8012 2.9827 3.8458 3.5164 4.7456 4.0080 5.1556 7.3522 4.1728 4.4980 4.9978 3.7939 5.2684 5.4028 6.4763 6.8155 5.2334 3.4195 1.9367 2.1689 3.8860 4.8485 1.6549 5.6334 6.2298 1.3306 1.6105 4.9908 3.9316 1.4062 1.3612 2.3025 1.6028 1.3309 1.9581 4.2084 1.6606 1.6578 1.9783 1.5869 3.2091 1.7911 1.4327 1.0602 2.4517 1.9423 1.9791 2.4905 1.7344 3.0477 1.7375 1.6984 2.7522 3.6103 1.6928 7.9869 1.2626 1.2412 6.5351 2.1019 1.1189 1.0608 1.0558 3.9937 1.0638 1.4814 1.7535 4.1302 9.7745 7.0855 6.5664 11.4961 6.6364 2.4755 2.0184 4.8230 1.0372 1.0385 1.0593 1.0974 1.0990 1.0936 1.1053 1.0862 1.0894 1.0901 1.1025 1.0918 1.0953 1.0956 1.0992 1.0451 1.1041
irintensity: 0.2240 1.2640 2.2383 0.3558 0.2398 1.6506 1.5523 4.4358 1.4282 1.3644 1.3282 1.4858 3.0570 5.2644 0.8328 6.3313 2.6712 6.6909 0.4918 0.2858 8.2671 6.6322 95.1859 179.2940 9.2344 27.2113 9.0164 5.4978 1.6294 5.3023 3.9795 0.6026 1.3724 4.9750 10.2180 6.1161 8.7212 7.5344 1.5536 3.0558 1.3191 4.4199 67.3883 9.0651 3.9172 5.7217 54.3832 6.5327 17.5525 0.1502 21.1083 47.5548 53.7357 0.7265 0.4544 47.1348 3.5319 0.0970 77.3099 23.3556 3.3493 8.1336 8.4913 7.3898 23.1177 23.0890 18.8462 1.1692 4.5681 194.7864 282.4293 9.4137 6.2478 13.6832 1.5195 3.5219 64.9356 144.4244 35.7454 5.3908 49.2326 14.7762 44.3446 3.2874 13.3306 19.7471 17.2613 9.2289 24.3942 19.1658 75.6319 120.3788 13.4382 62.3974 1.9953 284.4292 5.4165 36.0459 591.5855 49.2137 18.4697 3.0671 9.1222 10.4114 25.7437 9.5808 7.1123 3.2861 21.0635 13.6655 9.2929 10.8488 32.0588 10.9618 12.0035 135.0403 23.8312
temp: 298.150 k
press: 1.00000 atm
elementType: 8 8 8 7 7 7 6 6 6 6 6 6 6 6 6 6 6 6 6 6 6 6 6 6 1 1 1 1 1 1 1 1 1 1 1 1 1 1 1 1 1
symmnumber: 1
zpe: 830266.5 jmol-1
zpe.correction: 0.316232 hartree
zpe.thermalcorrener: 0.338455 hartree
zpe.thermalcorrenthalpy: 0.339400 hartree
zpe.thermalcorrgfe: 0.261774 hartree
zpe.sumelectzpe: -1084.381972 hartree
zpe.sumelectthermal: -1084.359748 hartree
zpe.sumelectthermalent: -1084.358804 hartree
zpe.sumelectthermalfe: -1084.436429 hartree
dipole: -3.3591 0.2575 -1.2730
dipole: 3.6015
quadrupole: -97.8183 -141.2844 -137.6124
quadrupole: 7.5507 -7.1381 10.0967
quadrupole: 27.7535 -15.7127 -12.0407 7.5507 -7.1381 10.0967
hfenergy: -1084.6982035 hartree
pointgroup: C01 [X(C18H17N3O3)]
dipole: -1.3240439 0.1925582 -0.4663639 debye
polarizability: 361.6958627|9.1244064|210.5577794|-5.9853989|-5.5160052|157.3981369 unknown
InChI: InChI=1S/C18H17N3O3/c1-11-5-3-4-6-16(11)21-17(10-24-12(2)22)20-15-8-7-13(19)9-14(15)18(21)23/h3-9H,10,19H2,1-2H3
charge 0 multiplicity 1
41 atoms
O  1.966349 -2.142753 -0.358433
O  -1.095453 2.259514 -0.639349
O  3.826266 -2.776349 0.89627
N  0.062732 0.340464 0.077423
N  -1.081056 -1.686037 0.726543
N  -6.056897 0.678881 -0.555252
C  1.327142 1.053145 -0.093859
C  0.034313 -0.992888 0.556614
C  -2.378488 0.268798 -0.084084
C  -1.139354 1.055726 -0.249016
C  -2.301225 -1.074689 0.405675
C  1.742484 1.994087 0.887045
C  1.334246 -1.66121 0.91517
C  -3.621615 0.85699 -0.401839
C  2.091795 0.804849 -1.252817
C  -3.511601 -1.806403 0.566824
C  -4.821124 0.119337 -0.243511
C  2.974247 2.661317 0.670764
C  -4.743692 -1.227292 0.24979
C  0.890468 2.296567 2.102875
C  3.311618 1.486616 -1.4500
C  3.754626 2.414907 -0.480982
C  3.25357 -2.679869 -0.211578
C  3.819744 -3.078587 -1.557094
H  1.117844 -2.534279 1.548925
H  2.048069 -0.992889 1.426396
H  -3.62663 1.888987 -0.770397
H  1.723939 0.082139 -1.986922
H  -3.446477 -2.832391 0.941649
H  3.318396 3.388736 1.415276
H  -5.667295 -1.805174 0.377071
H  1.437144 2.928247 2.822671
H  -0.027034 2.834413 1.79911
H  0.570178 1.376839 2.626699
H  3.904122 1.300832 -2.352193
H  4.700754 2.948986 -0.622583
H  -6.122674 1.629913 -0.906472
H  -6.915177 0.147529 -0.442503
H  4.330041 -2.207203 -2.007634
H  3.02129 -3.401032 -2.24286
H  4.561317 -3.880575 -1.422914
