program: Gaussian 09
title: 000056560
version: EM64L-G09RevD.01
frameworkgroup: C1[X(C16H24N2O3)]
method: RPBEPBE
basis: SDD
operation: Freq
keyword: #p
keyword: freq=noraman
keyword: PBEPBE/SDD
title: #p freq=noraman PBEPBE/SDD
converged: YES YES NO NO
title: Mulliken charges:
elementType: O O O N N C C C C C C C C C C C C C C C C H H H H H H H H H H H H H H H H H H H H H H H H
charge: -0.227715 -0.292855 -0.259342 -0.308655 -0.454393 -0.192092 -0.341009 -0.379541 -0.342576 -0.739067 0.226956 -0.688659 0.499386 -0.344809 -0.449007 0.236116 -0.355078 -0.320173 0.178900 -0.219581 -0.675670 0.182396 0.219128 0.164622 0.173689 0.221595 0.259722 0.189670 0.197224 0.207876 0.223286 0.267562 0.208016 0.216966 0.214332 0.301289 0.311399 0.222561 0.270472 0.269952 0.229005 0.228786 0.228548 0.228559 0.212207
chargesum: 0.00000
title: Mulliken charges with hydrogens summed into heavy atoms:
elementType: O O O N N C C C C C C C C C C C C C C C C
charge: -0.227715 -0.292855 -0.259342 -0.048933 -0.153104 -0.009695 0.042742 0.015743 0.044319 -0.040343 0.226956 -0.049345 0.499386 -0.033409 -0.226446 0.236116 -0.084606 -0.050221 0.178900 0.238210 -0.006357
polarizability: 3.13106730e+02 -3.37280248e+01 1.69665203e+02 -8.02165456e+00 -1.73637633e+01 1.68430195e+02
1716.lowfreq: -9.3739 -8.0876 -2.8329 -0.0010 -0.0005 0.0007 6.8109 16.4928 28.3350
frequency: -5.6509 16.4120 28.0594 32.2984 46.5958 56.0612 67.0705 82.5466 88.6394 98.7654 113.2889 119.1900 123.7485 166.9339 183.3937 217.3966 223.4214 226.2040 239.5345 251.0252 260.4676 305.0144 311.3993 336.1130 336.5931 355.6519 384.0170 413.7646 434.1240 468.3567 497.5642 519.2000 539.4305 624.8414 639.9418 667.4539 677.7176 680.8079 737.0877 747.9450 761.7745 783.0091 797.4684 804.9088 821.5718 840.8608 848.7456 876.8608 888.0378 895.9684 933.2563 953.5692 975.0278 1003.8461 1009.0987 1013.5218 1023.6617 1029.9777 1061.2168 1075.3179 1088.0809 1097.9228 1112.0180 1122.4806 1132.2544 1136.7090 1147.3899 1161.8648 1182.3199 1189.2000 1214.6376 1247.0542 1248.7499 1261.3358 1269.2238 1274.3001 1284.4759 1293.4647 1301.7472 1336.6049 1342.5386 1358.7314 1369.4291 1371.7043 1385.0430 1390.6105 1398.6595 1421.2794 1452.1091 1463.5151 1467.4759 1471.1469 1473.4805 1473.5417 1477.1831 1480.3708 1485.4402 1486.3898 1488.7228 1496.3847 1508.7105 1581.4316 1617.8808 1620.8839 1637.5074 2774.7294 2819.7817 2956.1104 2967.9279 2973.8996 2989.2093 2990.3466 2994.2599 3007.9886 3009.3088 3041.8290 3065.4932 3070.5937 3074.4834 3084.4039 3091.1655 3105.2877 3109.1807 3116.0033 3157.1986 3177.0082 3196.8953 3469.1120 3506.0754
redmass: 3.6087 4.3472 3.8274 1.6099 3.7137 3.9079 4.2218 5.1448 3.1210 3.2699 2.5657 2.1881 4.1779 3.4533 3.6806 1.7105 2.0298 1.1835 2.6563 1.3825 2.6018 3.6439 4.5632 5.3266 4.5766 4.3304 4.9972 2.9800 2.2396 3.2974 4.2997 2.7822 1.9786 6.3759 6.6551 1.2489 3.1060 4.0469 1.1062 4.6899 4.5053 5.9657 1.1040 1.1698 4.5974 1.4238 4.4068 3.3230 1.4849 2.1442 1.3121 1.4616 1.3665 3.4150 2.8705 1.3360 2.2806 2.3847 5.0430 2.3414 2.0297 2.2454 2.2150 1.4258 1.9403 1.4712 2.3973 3.3868 1.1885 2.1422 1.3631 2.6656 1.1488 1.4998 1.9055 1.1724 1.0734 1.3439 1.3893 1.4007 1.5098 1.4181 1.9172 2.5826 1.2091 1.2191 1.2727 4.6222 1.2063 1.0407 1.0702 1.0604 1.0638 1.0595 1.0432 1.1012 1.0727 1.1581 1.7756 1.0871 2.8952 6.1589 8.1301 6.5255 5.8407 1.0804 1.0713 1.0644 1.0606 1.0364 1.0367 1.0831 1.0357 1.0581 1.0976 1.1010 1.1064 1.1007 1.0995 1.0986 1.0986 1.1025 1.1003 1.0902 1.0910 1.0943 1.0952 1.0752 1.0759
irintensity: 1.3883 0.1320 1.9590 0.5554 0.7105 0.5684 0.5016 1.9995 1.7744 3.1797 0.4613 2.1185 1.2591 1.5834 2.8743 0.6757 0.8756 0.2070 12.0514 0.6637 3.5806 2.4702 6.6586 4.0210 1.7847 4.7208 16.2515 0.0571 38.6730 9.5615 12.4875 29.0909 47.3661 4.1770 0.2262 38.9573 18.3029 28.2291 10.6495 8.2824 19.1533 4.6350 1.7634 1.4357 1.6215 32.0931 8.4793 12.4968 50.5681 5.4310 3.7579 3.6721 0.0485 28.0021 3.6743 0.4046 26.7454 7.6857 447.8094 1.7402 5.3950 6.6436 3.1058 32.7304 19.0760 5.4806 61.5772 53.2896 134.8773 28.9109 1.9558 339.6525 8.2900 54.5472 71.0671 3.2698 0.8553 17.4174 60.4165 26.6686 21.7096 3.5697 89.4046 144.9088 29.9505 10.3900 19.6456 34.6985 15.6881 12.0376 0.8615 7.8214 3.7846 6.3326 11.1873 6.3539 16.5912 14.5542 121.9294 12.6537 274.7568 114.8276 236.5237 133.5887 94.1187 114.6963 115.7438 11.7854 48.6665 37.3068 32.4148 51.4772 23.3515 23.9036 4.1413 38.7222 8.2787 81.9520 50.5982 33.8517 34.2942 46.5590 13.4809 18.7599 1.6732 2.4304 3.8845 0.5536 16.4050
temp: 298.150 k
press: 1.00000 atm
elementType: 8 8 8 7 7 6 6 6 6 6 6 6 6 6 6 6 6 6 6 6 6 1 1 1 1 1 1 1 1 1 1 1 1 1 1 1 1 1 1 1 1 1 1 1 1
symmnumber: 1
zpe: 988630.3 jmol-1
zpe.correction: 0.376549 hartree
zpe.thermalcorrener: 0.399222 hartree
zpe.thermalcorrenthalpy: 0.400166 hartree
zpe.thermalcorrgfe: 0.321671 hartree
zpe.sumelectzpe: -957.682802 hartree
zpe.sumelectthermal: -957.660130 hartree
zpe.sumelectthermalent: -957.659186 hartree
zpe.sumelectthermalfe: -957.737680 hartree
dipole: 2.0640 2.4434 -5.6357
dipole: 6.4801
quadrupole: -107.7365 -127.8823 -128.7995
quadrupole: -6.8861 0.3520 5.4030
quadrupole: 13.7362 -6.4095 -7.3267 -6.8861 0.3520 5.4030
hfenergy: -958.0593517 hartree
pointgroup: C01 [X(C16H24N2O3)]
dipole: -0.8235832 -0.0530039 2.4121895 debye
polarizability: 310.3010762|39.7128452|159.3025867|6.6181375|12.5258877|181.5984662 unknown
InChI: InChI=1S/C16H24N2O3/c1-4-6-11-17-12(3)15(19)18-14-9-7-13(8-10-14)16(20)21-5-2/h7-10,12,17-18H,4-6,11H2,1-3H3
charge 0 multiplicity 1
45 atoms
O  -1.863196 -1.697056 -1.947975
O  5.056417 0.674201 0.608183
O  4.938632 0.498968 -1.714897
N  -4.379236 -1.055468 -0.239473
N  -1.037719 -1.316298 0.219632
C  -3.370423 -2.102869 -0.025112
C  -4.222644 0.190341 0.531704
C  -5.394912 1.155656 0.270627
C  -5.296229 2.456921 1.097875
C  -3.846274 -3.432322 -0.642158
C  -2.029704 -1.686899 -0.697839
C  -6.470205 3.423184 0.830138
C  0.295427 -0.895847 -0.024005
C  0.847995 -0.791647 -1.331453
C  1.097221 -0.571101 1.107413
C  2.984847 -0.048754 -0.358202
C  2.181312 -0.371533 -1.482076
C  2.426766 -0.152337 0.943346
C  4.386765 0.388149 -0.590016
C  6.47354 1.120329 0.464928
C  6.998363 1.381126 1.873208
H  -3.17413 -2.264588 1.072127
H  -3.277447 0.682172 0.22608
H  -4.14267 -0.001512 1.635813
H  -6.352649 0.644597 0.509859
H  -5.42412 1.394254 -0.809991
H  -5.337099 -1.424814 -0.221288
H  -5.262276 2.205008 2.177653
H  -4.338642 2.96562 0.865238
H  -4.816879 -3.735751 -0.207096
H  -3.118824 -4.241079 -0.455715
H  -3.957551 -3.308566 -1.732196
H  -7.438411 2.951924 1.084664
H  -6.376742 4.347754 1.428619
H  -6.508824 3.713153 -0.236562
H  -1.316596 -1.355006 1.204223
H  0.228688 -1.038455 -2.195067
H  0.672334 -0.649443 2.116557
H  2.624274 -0.285972 -2.479837
H  3.043319 0.096969 1.810958
H  6.491897 2.025288 -0.16932
H  7.037472 0.326407 -0.057805
H  6.408497 2.16745 2.374825
H  6.953132 0.46519 2.487095
H  8.051004 1.714757 1.823918
