program: Gaussian 09
title: 000113985
version: EM64L-G09RevD.01
frameworkgroup: C1[X(C12H26N4S2)]
method: RPBEPBE
basis: SDD
operation: Freq
keyword: #p
keyword: freq=noraman
keyword: PBEPBE/SDD
title: #p freq=noraman PBEPBE/SDD
converged: YES YES NO NO
title: Mulliken charges:
elementType: S S N N N N C C C C C C C C C C C C H H H H H H H H H H H H H H H H H H H H H H H H H H
charge: 0.122557 0.129686 -0.602342 -0.592958 -0.328148 -0.307249 -0.374009 -0.384005 -0.392146 -0.379143 -0.354849 -0.369490 -0.368077 -0.350779 -0.698896 -0.700700 -0.074497 -0.092489 0.190102 0.194852 0.192783 0.193226 0.189614 0.203711 0.194727 0.194787 0.208009 0.195559 0.192926 0.195016 0.197247 0.239731 0.214684 0.217907 0.262450 0.323762 0.257379 0.276786 0.327829 0.317698 0.325732 0.330229 0.226634 0.254154
chargesum: 0.00000
title: Mulliken charges with hydrogens summed into heavy atoms:
elementType: S S N N N N C C C C C C C C C C C C
charge: 0.122557 0.129686 0.043185 0.063003 -0.101514 -0.053094 0.010945 0.002003 0.001179 0.010371 0.048718 0.018452 0.068902 0.081813 -0.112684 -0.166535 -0.074497 -0.092489
polarizability: 2.83059851e+02 9.32046078e-02 1.52836493e+02 9.07589087e+00 9.01808824e+00 1.64351045e+02
1716.lowfreq: -39.3802 -4.2552 -3.6930 -0.0020 -0.0015 0.0009 9.2328 10.2585 17.4295
frequency: -29.9868 9.0156 16.9920 17.4086 22.2219 29.4920 35.6991 46.0170 62.3867 67.6225 86.9562 96.8749 105.5607 129.2788 139.4369 162.7089 166.8233 197.5763 246.2313 286.9798 317.4370 336.8956 346.9337 352.0650 375.3310 389.9540 405.6791 428.0167 432.2280 456.7150 457.9475 475.8162 496.6388 557.1413 573.6203 582.3370 593.5076 614.8700 710.1505 714.0675 717.7437 720.2170 724.6759 740.5712 766.1213 801.0430 842.4059 885.4281 913.0603 935.2949 980.0022 995.0680 998.7256 1003.7653 1028.2763 1041.3494 1048.6859 1053.4403 1068.5753 1074.9949 1078.4736 1079.3017 1084.2645 1096.2821 1112.7260 1167.5933 1197.2333 1208.6468 1231.6847 1235.5711 1256.1276 1258.4844 1270.3459 1274.3861 1279.8580 1281.2453 1291.0554 1293.0493 1294.6739 1298.0768 1310.1211 1334.9077 1349.0233 1351.0405 1353.4486 1358.0183 1425.2252 1449.8808 1454.7799 1457.9522 1458.8808 1462.4161 1463.9874 1471.4767 1479.8871 1485.0687 1591.5714 1613.6934 1644.6582 1666.9261 2949.1115 2949.6903 2952.7788 2955.9223 2957.9464 2962.3722 2967.7185 2981.3879 2983.0216 2990.3376 2999.6888 3000.2290 3013.2107 3015.4804 3027.2869 3037.3249 3040.2189 3045.6292 3081.8515 3099.1522 3376.3759 3455.0894 3526.8367 3545.5286 3675.7026 3701.5770
redmass: 1.8771 5.3711 5.5979 5.5475 3.5977 4.1933 5.0650 4.3414 2.5649 4.7280 2.3320 4.7776 2.3732 2.2042 2.1189 4.0892 3.9847 3.1982 3.3984 2.5148 3.4873 1.2969 2.0773 1.2093 3.0146 2.5483 1.3731 4.0214 2.9654 2.2695 2.2742 2.7455 2.8254 3.0272 3.6422 2.6145 4.3568 4.6355 1.8132 2.0921 1.0704 1.4309 1.1132 1.1519 1.2242 1.3511 1.5674 1.7609 1.8983 1.4213 1.6820 3.8618 1.3731 3.6558 1.2906 1.7257 2.6231 3.0623 1.1886 2.4347 1.9294 2.1434 1.8646 1.7305 2.3664 1.2118 1.6051 1.2578 1.3966 1.3172 1.8986 1.3130 1.5420 2.0261 1.1568 1.1253 1.0707 1.1768 1.3164 1.1032 1.2731 1.3858 1.5429 1.4879 1.6433 1.5305 1.0967 1.0841 1.0817 1.0761 1.0731 1.0665 1.0795 1.0964 1.1003 1.1010 1.2115 1.2694 3.9697 5.1347 1.0587 1.0588 1.0593 1.0600 1.0648 1.0591 1.0599 1.0593 1.0962 1.0980 1.0861 1.0699 1.0996 1.0639 1.1036 1.0987 1.1005 1.1044 1.1086 1.1048 1.0772 1.0780 1.0447 1.0446 1.1043 1.1047
irintensity: 0.4768 0.1559 0.4137 0.1500 1.3063 1.8971 1.2529 11.8706 1.4195 1.1222 0.6460 0.0415 1.3758 0.1227 0.2204 4.1145 0.9408 2.8618 1.4115 13.4183 1.8793 12.4170 14.9542 74.4964 1.4411 48.6288 233.1010 33.8793 3.6590 64.9782 102.6866 44.5052 3.4968 23.1544 53.7441 81.4452 80.7930 10.1550 23.4392 38.3218 19.2807 86.6551 3.7682 14.3742 6.5743 9.4794 3.2508 6.4890 5.3952 9.3384 148.2617 0.1689 4.1510 1.2518 185.5260 5.5623 3.8218 4.0906 4.1478 2.0549 4.3212 0.1203 2.2042 1.0791 0.2246 11.9001 0.6247 2.1940 5.3528 57.5545 221.3903 21.0395 25.8503 200.2531 18.3634 12.1603 1.4108 0.2404 5.8888 0.5181 5.1923 0.1526 2.4107 0.4099 0.8526 0.7437 26.7006 6.5633 12.2592 0.7676 0.6423 4.0348 0.1123 2.3174 0.7187 26.6252 84.4873 104.2994 247.8310 271.3012 0.0438 0.0362 0.7718 2.5524 28.2993 70.5443 108.4652 29.3151 0.3809 1.0878 9.4962 18.7357 2.1815 18.3237 1.8554 55.6175 53.2762 160.5217 43.1795 7.3649 19.1597 8.3206 31.4216 55.3927 22.2520 34.9206
temp: 298.150 k
press: 1.00000 atm
elementType: 16 16 7 7 7 7 6 6 6 6 6 6 6 6 6 6 6 6 1 1 1 1 1 1 1 1 1 1 1 1 1 1 1 1 1 1 1 1 1 1 1 1 1 1
symmnumber: 1
zpe: 984799.3 jmol-1
zpe.correction: 0.375090 hartree
zpe.thermalcorrener: 0.398698 hartree
zpe.thermalcorrenthalpy: 0.399642 hartree
zpe.thermalcorrgfe: 0.314762 hartree
zpe.sumelectzpe: -1486.524178 hartree
zpe.sumelectthermal: -1486.500570 hartree
zpe.sumelectthermalent: -1486.499626 hartree
zpe.sumelectthermalfe: -1486.584506 hartree
dipole: -3.0038 -0.3947 -2.5065
dipole: 3.9321
quadrupole: -100.9474 -125.5449 -132.1604
quadrupole: 19.7578 1.1691 3.3793
quadrupole: 18.6035 -5.9940 -12.6095 19.7578 1.1691 3.3793
hfenergy: -1486.8992678 hartree
pointgroup: C01 [X(C12H26N4S2)]
dipole: 1.1937465 0.1865923 0.9661069 debye
polarizability: 283.0595199|-3.6498874|148.0832224|8.2046076|-2.4044809|169.1046469 unknown
InChI: InChI=1S/C12H26N4S2/c13-11(14)17-9-7-5-3-1-2-4-6-8-10-18-12(15)16/h13,15H,1-10,14,16H2
charge 0 multiplicity 1
44 atoms
S  5.713857 -1.415272 0.266911
S  -6.837991 0.35289 0.988134
N  8.082664 -1.822946 1.462851
N  -9.435315 0.279446 0.263144
N  8.151137 -0.401484 -0.514517
N  -8.105352 -0.792189 -1.341311
C  1.063538 1.026357 0.311006
C  -0.232143 0.594801 -0.412278
C  2.334664 0.846306 -0.549548
C  -1.503735 0.798864 0.441631
C  3.628033 1.249682 0.196265
C  -2.795905 0.337336 -0.27011
C  4.909645 1.179752 -0.666178
C  -4.062855 0.560445 0.590369
C  5.307686 -0.224346 -1.150739
C  -5.333829 0.073451 -0.126465
C  7.54806 -1.140607 0.373045
C  -8.20826 -0.142726 -0.217734
H  0.977176 2.090271 0.616651
H  1.171645 0.442136 1.248818
H  -0.330539 1.1651 -1.359812
H  -0.15107 -0.474392 -0.700177
H  2.240083 1.453217 -1.474937
H  2.399536 -0.212027 -0.875339
H  -1.395486 0.245763 1.397954
H  -1.595795 1.871682 0.711062
H  3.757836 0.603006 1.087968
H  3.513046 2.286387 0.574078
H  -2.706684 -0.738833 -0.526788
H  -2.899729 0.88228 -1.231425
H  4.773935 1.812854 -1.569847
H  5.765528 1.606116 -0.109539
H  -3.951313 0.02538 1.554298
H  -4.162018 1.637063 0.830728
H  4.512133 -0.727058 -1.72482
H  6.241505 -0.186663 -1.738796
H  -5.264765 -1.007575 -0.344896
H  -5.503084 0.629245 -1.065275
H  7.484194 -2.340332 2.104564
H  9.086921 -1.819666 1.628925
H  -9.509136 0.927292 1.042397
H  -10.265609 0.015007 -0.263775
H  9.174473 -0.291431 -0.393511
H  -7.166779 -1.141584 -1.586983
