program: Gaussian 09
title: 000113928
version: EM64L-G09RevD.01
frameworkgroup: C1[X(C13H20O4)]
method: RPBEPBE
basis: SDD
operation: Freq
keyword: #pfreq=noraman
keyword: PBEPBE/SDD
title: #p freq=noraman PBEPBE/SDD
converged: YES YES NO NO
title: Mulliken charges:
elementType: O O O O C C C C C C C C C C C C C H H H H H H H H H H H H H H H H H H H H
charge: -0.255323 -0.289928 -0.445278 -0.422101 -0.382278 -0.290939 -0.341979 -0.109944 -0.314252 0.223678 0.232624 -0.297216 -0.686280 -0.332084 -0.330474 -0.249199 -0.249403 0.211838 0.211589 0.203148 0.204347 0.194409 0.192652 0.193111 0.204080 0.224814 0.234823 0.168746 0.212636 0.214000 0.217804 0.252527 0.246980 0.225524 0.226332 0.369655 0.331364
chargesum: 0.00000
title: Mulliken charges with hydrogens summed into heavy atoms:
elementType: O O O O C C C C C C C C C C C C C
charge: -0.255323 -0.289928 -0.075623 -0.090737 0.041149 0.116555 0.045083 0.083167 0.114642 0.223678 0.232624 0.106352 -0.041841 -0.079557 -0.083494 -0.023675 -0.023072
polarizability: 1.89425679e+02 2.17952752e+00 1.90519630e+02 -3.74144742e+00 4.11983612e+00 9.83096220e+01
1716.lowfreq: -4.4114 -0.0004 0.0007 0.0010 5.2115 8.5504 22.9029 35.7815 40.3027
frequency: 22.7950 35.7551 40.1423 51.1646 61.4060 69.8032 84.8844 110.1690 131.6847 148.5511 171.1948 179.9030 187.1930 206.3585 237.4718 242.5251 266.6082 294.2135 315.1578 390.4116 434.0256 449.0369 457.3170 495.7683 518.3076 537.0252 557.9652 587.4131 607.5427 721.8189 741.1928 745.5888 763.1852 804.4948 814.5165 832.9385 846.1306 903.3289 905.0241 926.3755 943.4295 950.3271 958.2005 966.1399 990.4677 1042.6880 1046.6631 1053.7918 1067.6428 1089.0734 1099.8922 1113.2964 1124.4499 1147.1365 1162.2785 1172.7332 1193.5498 1214.6288 1215.0450 1244.9345 1262.8628 1276.8205 1280.0412 1282.1117 1285.6186 1286.9857 1332.0407 1348.3455 1354.7941 1378.1582 1380.5847 1394.3571 1400.0494 1408.7426 1434.5806 1451.5061 1460.8941 1469.3730 1472.9589 1479.5047 1481.0912 1489.7998 1497.4907 1594.2451 1603.1726 2909.4925 2932.1784 2945.7267 2962.0981 2967.9601 2977.9531 2997.1144 3003.2492 3012.3357 3031.1696 3061.9408 3076.5834 3077.7391 3083.4387 3135.5523 3149.5072 3162.6702 3174.2926 3504.2671 3561.9847
redmass: 5.3817 3.3998 4.5250 3.7548 1.6874 2.2492 4.3415 2.9848 2.5186 2.0598 3.3811 2.0881 4.4825 3.5515 1.1558 4.1473 3.7997 5.0431 4.2529 3.5796 3.5449 2.5972 3.2027 1.4741 2.0289 5.0647 4.0031 6.2285 4.2913 3.7909 1.1927 1.1155 5.7927 5.9518 1.1780 1.4379 3.2012 1.3796 1.7997 1.5359 1.1550 5.4342 1.2928 6.9381 4.6934 3.2903 2.2077 2.5775 2.0190 2.2105 3.2041 2.1447 2.5930 1.4635 1.1566 1.0556 2.8775 1.1817 1.3615 3.2499 1.0786 1.3189 1.4656 1.1757 1.2277 1.0816 1.2791 1.4753 1.2589 1.5089 1.3792 1.3024 3.6134 1.5834 2.3288 1.0949 1.1020 1.0862 1.0855 1.0419 1.1421 1.1784 1.8943 6.2168 7.4711 1.0826 1.0696 1.0550 1.0550 1.0590 1.0361 1.0595 1.1053 1.1015 1.1079 1.1042 1.1010 1.0999 1.0926 1.0849 1.0896 1.0936 1.0998 1.0650 1.0662
irintensity: 1.0794 2.3378 0.1557 3.2722 1.9773 14.2044 1.2413 1.1071 34.2683 3.7749 30.2160 64.7801 3.8019 10.2602 0.3908 8.4214 1.1524 0.2304 1.8237 2.4798 1.7390 47.6406 3.3622 82.4556 82.9395 0.2245 0.1728 4.8330 11.8209 0.2738 112.2641 6.7231 19.4070 6.6675 0.5587 1.5142 25.3373 5.4920 18.8000 28.4845 0.2764 90.6018 0.0317 63.3034 21.5654 23.6470 52.2252 48.3770 6.8694 10.9785 26.5504 132.5709 13.8022 1.8844 60.1996 2.8456 151.9804 7.6200 0.0069 250.9884 12.7165 12.0059 15.7517 0.6706 17.8441 2.1171 29.4824 0.0250 4.8104 4.9201 34.2914 6.0422 4.7341 5.0086 34.0015 17.6568 23.3579 5.4157 3.1625 13.2634 44.3790 57.9428 80.0064 58.0343 12.8542 61.7876 63.9986 35.7242 53.2884 36.2193 33.9183 34.5145 28.4434 4.0272 37.9047 18.7713 88.8723 58.6023 25.0008 0.0273 20.3202 28.5948 10.0269 29.4673 7.2037
temp: 298.150 k
press: 1.00000 atm
elementType: 8 8 8 8 6 6 6 6 6 6 6 6 6 6 6 6 6 1 1 1 1 1 1 1 1 1 1 1 1 1 1 1 1 1 1 1 1
symmnumber: 1
zpe: 810626.3 jmol-1
zpe.correction: 0.308751 hartree
zpe.thermalcorrener: 0.327903 hartree
zpe.thermalcorrenthalpy: 0.328847 hartree
zpe.thermalcorrgfe: 0.258720 hartree
zpe.sumelectzpe: -806.895992 hartree
zpe.sumelectthermal: -806.876841 hartree
zpe.sumelectthermalent: -806.875896 hartree
zpe.sumelectthermalfe: -806.946023 hartree
dipole: -2.9836 2.9682 -1.9977
dipole: 4.6586
quadrupole: -97.7531 -106.0297 -104.5566
quadrupole: 15.1552 -9.7139 7.6617
quadrupole: 5.0267 -3.2499 -1.7768 15.1552 -9.7139 7.6617
hfenergy: -807.2047436 hartree
pointgroup: C01 [X(C13H20O4)]
dipole: 1.4175995 -0.7584389 0.8800483 debye
polarizability: 189.1537667|1.6051246|190.3488225|3.556506|7.8021039|98.7523417 unknown
InChI: InChI=1S/C13H20O4/c1-2-3-8-16-12-6-4-5-7-13(12)17-10-11(15)9-14/h4-7,11,14-15H,2-3,8-10H2,1H3
charge 0 multiplicity 1
37 atoms
O  0.29708 -1.335939 0.245518
O  -0.474995 1.173147 0.513385
O  -2.802256 1.499822 -0.82691
O  -4.642655 3.699291 0.154536
C  -0.615586 -3.562525 0.013434
C  0.680371 -2.754194 0.097971
C  -0.345283 -5.076985 -0.147712
C  -2.504128 2.387186 0.294159
C  -0.980202 2.552781 0.441726
C  1.328493 -0.395499 0.356423
C  0.91347 0.966986 0.487183
C  -3.184205 3.739483 0.043386
C  -1.648776 -5.901366 -0.213788
C  2.708589 -0.697465 0.339515
C  1.87532 1.99302 0.587891
C  3.669514 0.337608 0.446661
C  3.256426 1.677982 0.568049
H  -1.212074 -3.380423 0.927641
H  -1.215345 -3.194031 -0.840766
H  1.288004 -3.067249 0.973187
H  1.290542 -2.879903 -0.821291
H  0.249674 -5.251566 -1.067315
H  0.274733 -5.434906 0.699686
H  -2.890417 1.944874 1.243931
H  -0.719563 3.112737 1.362762
H  -0.551267 3.063407 -0.444641
H  -2.98512 4.061442 -0.9920
H  -2.761582 4.491721 0.747783
H  -2.246979 -5.76959 0.707008
H  -2.275203 -5.585265 -1.068736
H  -1.437559 -6.979928 -0.329468
H  3.044674 -1.733373 0.23914
H  1.560047 3.036151 0.686725
H  4.735299 0.086978 0.43155
H  3.995645 2.481478 0.648258
H  -2.220428 0.699255 -0.72164
H  -4.894858 3.153658 0.941961
