program: Gaussian 09
title: 000113917
version: EM64L-G09RevD.01
frameworkgroup: C1[X(C19H21N3S)]
method: RPBEPBE
basis: SDD
operation: Freq
keyword: #p
keyword: freq=noraman
keyword: PBEPBE/SDD
title: #p freq=noraman PBEPBE/SDD
converged: YES YES NO NO
title: Mulliken charges:
elementType: S N N N C C C C C C C C C C C C C C C C C C C H H H H H H H H H H H H H H H H H H H H H
charge: 0.238991 -0.270922 -0.087174 -0.029449 -0.044097 -0.454816 -0.366698 -0.711627 0.508898 0.500792 -0.362046 -0.353593 -0.311687 -0.331337 -0.629457 -0.614641 -0.430687 -0.263076 -0.408772 -0.236878 0.409781 -0.250319 -0.264826 0.242736 0.210240 0.225878 0.174928 0.207498 0.231659 0.248069 0.191200 0.257902 0.241997 0.224070 0.234574 0.187263 0.226216 0.224230 0.187213 0.273626 0.250459 0.257301 0.230818 0.235762
chargesum: 0.00000
title: Mulliken charges with hydrogens summed into heavy atoms:
elementType: S N N N C C C C C C C C C C C C C C C C C C C
charge: 0.238991 -0.270922 -0.087174 -0.029449 0.198639 -0.018699 0.015728 -0.040698 0.508898 0.500792 -0.362046 -0.353593 -0.053784 -0.089341 0.016450 0.023018 -0.157061 -0.012618 -0.151470 -0.006060 0.409781 -0.014557 -0.264826
polarizability: 2.44132268e+02 4.61945168e+00 3.59827286e+02 -3.17388104e+01 8.41796065e+00 1.64916181e+02
1716.lowfreq: -10.2876 -4.0546 0.0004 0.0013 0.0017 4.4989 23.9674 32.6208 35.7941
frequency: 23.8154 32.4347 35.7061 45.1986 62.5342 92.0686 106.5816 112.9182 128.1540 145.7916 159.7117 190.1524 199.3233 205.1839 222.9444 235.3236 250.3613 280.1813 307.2334 309.4445 328.3207 347.6447 366.7209 382.4578 410.2761 417.9024 430.8568 437.6276 450.3889 471.4178 490.0914 505.2170 533.1128 541.7105 570.8166 595.9252 629.3437 653.8012 678.4442 697.2740 722.7870 733.4252 754.4953 811.9005 826.7711 830.3819 837.2412 850.5578 867.8721 899.8804 915.6591 930.4642 935.4874 944.3623 954.8595 974.8403 1023.9858 1028.8663 1033.8600 1041.9772 1043.1483 1086.5602 1091.3395 1103.0868 1119.2563 1132.1788 1142.5338 1150.9651 1162.5812 1175.5401 1190.9283 1201.6190 1239.0325 1250.4001 1262.6580 1267.0132 1285.2698 1285.6192 1296.4115 1328.9946 1350.9486 1354.6233 1370.0028 1372.5986 1378.3339 1388.5223 1414.4591 1419.1249 1429.6203 1441.4951 1460.7525 1461.9823 1462.6391 1467.9816 1472.9610 1477.4505 1480.1276 1484.4255 1486.9218 1491.2726 1541.9827 1578.0138 1586.6726 1614.1105 2170.6345 2792.4311 2844.2400 2859.3910 2940.4264 2976.5697 2985.6992 3005.3945 3019.7305 3030.6008 3067.4317 3072.8945 3078.5803 3086.1348 3097.8982 3134.7802 3144.2798 3152.0039 3157.5970 3160.0287 3172.2674 3173.6296
redmass: 3.2235 3.7995 4.9346 6.3197 3.5140 2.7797 5.8184 4.7485 4.1853 3.7821 4.7733 4.0207 2.8988 1.1889 1.1852 1.1229 4.8373 5.3175 6.1511 2.9525 2.8169 7.8294 1.9818 5.3046 3.2706 6.6960 2.4119 3.2790 2.6452 5.5214 5.1078 4.5856 4.7348 4.0321 5.3443 5.1099 4.5370 5.8651 7.2909 5.3430 4.4510 3.5276 1.3684 4.8201 1.4599 4.4077 2.6271 1.4413 3.1930 1.4528 1.3636 1.4300 1.8851 1.7163 1.3565 1.3171 4.7304 3.9744 1.6646 2.1824 2.0880 1.3887 2.6033 1.7792 2.0171 1.5946 1.9028 1.8802 1.4184 1.0775 1.9893 2.6277 1.8627 2.2863 2.5492 1.3976 1.4865 1.6856 1.3048 2.1617 1.8253 1.7256 1.3645 2.6398 2.6874 1.3016 4.9122 1.1429 2.3492 1.1523 1.1315 1.9295 1.1599 1.0592 1.0762 1.0643 1.0808 1.1667 1.4523 1.4656 6.7568 6.5657 6.6121 6.8971 12.6262 1.0699 1.0573 1.0572 1.0696 1.0387 1.0822 1.0853 1.0720 1.0715 1.0937 1.0950 1.1009 1.1005 1.0995 1.0852 1.0899 1.0880 1.0939 1.0929 1.1007 1.0966
irintensity: 0.6121 0.4133 0.0902 0.0616 1.6522 0.0792 2.3895 2.6931 0.8660 0.8332 0.9779 0.3215 2.0553 2.4769 0.7606 0.2126 0.9277 0.6967 0.8446 4.5322 5.8068 5.6217 1.3741 1.6220 2.4781 0.0404 2.1360 3.1553 2.8480 5.9101 12.2668 1.5938 3.8904 2.4027 3.0148 1.9950 11.5725 0.7231 0.9290 2.7297 5.9403 4.5866 91.1186 41.8265 42.5975 7.6693 4.9991 0.4422 0.3076 22.2272 6.3077 2.6813 2.2215 10.4358 1.6241 0.0520 35.6718 13.0174 16.8448 10.3134 41.6325 5.1736 10.0063 20.5743 13.8051 8.9837 13.1428 1.8623 18.0743 1.4191 19.3457 30.8989 65.4827 60.2224 2.7094 4.2855 4.2010 6.4028 32.2026 133.7111 2.2214 6.7803 11.3094 21.8436 4.9295 15.4189 9.3050 2.8840 16.7042 1.3712 43.1066 266.2739 14.7282 7.3845 19.5074 20.7565 3.1639 19.2140 28.7720 55.6404 3.2462 3.8113 62.2885 58.8626 118.9172 95.5352 67.5918 212.0794 56.1617 17.0572 4.4946 33.1864 45.3476 34.6980 6.0065 37.6342 33.9090 54.8782 18.2840 2.3459 6.0481 4.4696 20.0787 0.9911 22.0547 8.5872
temp: 298.150 k
press: 1.00000 atm
elementType: 16 7 7 7 6 6 6 6 6 6 6 6 6 6 6 6 6 6 6 6 6 6 6 1 1 1 1 1 1 1 1 1 1 1 1 1 1 1 1 1 1 1 1 1
symmnumber: 1
zpe: 932661.9 jmol-1
zpe.correction: 0.355232 hartree
zpe.thermalcorrener: 0.377418 hartree
zpe.thermalcorrenthalpy: 0.378362 hartree
zpe.thermalcorrgfe: 0.302884 hartree
zpe.sumelectzpe: -1297.240495 hartree
zpe.sumelectthermal: -1297.218309 hartree
zpe.sumelectthermalent: -1297.217365 hartree
zpe.sumelectthermalfe: -1297.292843 hartree
dipole: 3.8807 -5.7139 -2.1214
dipole: 7.2255
quadrupole: -137.0647 -169.5601 -145.0299
quadrupole: 19.9299 -8.1606 5.0086
quadrupole: 13.4869 -19.0086 5.5217 19.9299 -8.1606 5.0086
hfenergy: -1297.5957274 hartree
pointgroup: C01 [X(C19H21N3S1)]
dipole: 2.5090109 -1.0339771 -0.8466986 debye
polarizability: 274.8292406|-52.0117366|328.3301776|-31.5423126|-11.8047138|165.7163171 unknown
InChI: InChI=1S/C19H21N3S/c1-14(12-21(2)3)13-22-16-6-4-5-7-18(16)23-19-10-15(11-20)8-9-17(19)22/h4-10,14H,12-13H2,1-3H3
charge 0 multiplicity 1
44 atoms
S  -1.841791 -1.608691 1.675948
N  0.325291 -0.783854 -0.328756
N  4.099867 2.486535 0.46451
N  -5.12067 3.473084 -0.167963
C  2.201878 0.813614 0.256472
C  1.658817 -0.263437 -0.721985
C  3.476992 1.436336 -0.369834
C  2.478491 0.218876 1.651926
C  -0.777699 0.106312 -0.288262
C  0.105566 -2.200117 -0.26948
C  -1.913065 -0.180693 0.527226
C  -0.902009 -2.739556 0.575919
C  -0.801239 1.303781 -1.059736
C  0.855047 -3.102517 -1.071717
C  3.278388 3.708093 0.579108
C  5.481427 2.789284 0.03885
C  -3.034616 0.66127 0.543379
C  -1.148997 -4.124891 0.629597
C  -1.905177 2.171716 -1.022108
C  0.635994 -4.494798 -0.989938
C  -3.040115 1.859644 -0.225767
C  -0.364546 -5.014506 -0.139683
C  -4.174941 2.739315 -0.192252
H  1.436192 1.606926 0.360271
H  1.646584 0.126791 -1.763033
H  2.36011 -1.114154 -0.704535
H  3.2258 1.82566 -1.396115
H  4.229199 0.633085 -0.508633
H  1.554384 -0.180281 2.106666
H  2.902822 0.992537 2.313587
H  3.216078 -0.604991 1.588222
H  0.046094 1.553415 -1.703484
H  1.599331 -2.720052 -1.776555
H  3.79349 4.436576 1.229786
H  2.303918 3.478897 1.043081
H  3.085807 4.201421 -0.408816
H  6.088594 1.866723 0.057817
H  5.936004 3.510487 0.74143
H  5.545916 3.226387 -0.990726
H  -3.898466 0.40887 1.165673
H  -1.942551 -4.50496 1.281488
H  -1.900656 3.088179 -1.620036
H  1.237434 -5.169536 -1.608481
H  -0.54207 -6.092875 -0.080661
