program: Gaussian 09
title: 000113861
version: EM64L-G09RevD.01
frameworkgroup: C1[X(C9H8N4O4S)]
method: RPBEPBE
basis: SDD
operation: Freq
keyword: #p
keyword: freq=noraman
keyword: PBEPBE/SDD
title: #p freq=noraman PBEPBE/SDD
converged: YES YES NO NO
title: Mulliken charges:
elementType: S O O O O N N N N C C C C C C C C C H H H H H H H H
charge: 0.147153 -0.191378 -0.220868 -0.214278 -0.198920 -0.145376 -0.114341 0.071129 0.050544 -0.468307 0.167121 -0.161595 -0.612187 0.355528 -0.332667 -0.306871 0.274008 -0.299970 0.284759 0.284854 0.261738 0.263383 0.261724 0.251558 0.296819 0.296442
chargesum: 0.00000
title: Mulliken charges with hydrogens summed into heavy atoms:
elementType: S O O O O N N N N C C C C C C C C C
charge: 0.147153 -0.191378 -0.220868 -0.214278 -0.198920 -0.145376 -0.114341 0.071129 0.050544 0.101306 0.167121 -0.161595 0.174658 0.355528 -0.081109 -0.010052 0.274008 -0.003528
polarizability: 3.97717145e+02 1.12059201e+01 1.89370715e+02 -5.64385096e-03 3.07870582e-02 6.73246778e+01
1716.lowfreq: -5.8075 -4.7482 0.0013 0.0016 0.0019 4.9567 31.3820 39.3848 40.9855
frequency: 31.3645 39.3842 40.9737 73.4865 102.1109 106.5135 125.4855 131.4037 175.9893 177.7421 204.6587 229.6329 250.1799 266.3330 308.9265 323.0067 375.2580 409.9238 439.6158 483.3595 521.9567 554.8242 562.5917 610.9133 619.2238 622.1598 653.2059 659.4041 680.0815 734.2662 796.0566 827.5719 862.9486 905.9944 914.2825 918.6565 944.9944 984.4752 989.0078 1020.3297 1055.2748 1117.0217 1128.5927 1133.0277 1158.1058 1167.8331 1196.6066 1215.3359 1222.8871 1261.2320 1302.9205 1324.2640 1343.1407 1354.2579 1373.1933 1383.1469 1438.7033 1449.1520 1463.3626 1481.6925 1496.8589 1548.1746 1578.4099 1675.9645 2996.6069 3009.5124 3055.6112 3060.5570 3104.0496 3130.2496 3241.5937 3260.1985
redmass: 7.7932 6.8013 8.9507 6.8039 3.2697 1.1804 8.7930 12.4250 3.7791 8.9247 4.7568 8.5420 4.6619 3.7305 2.8305 7.1853 7.3236 7.9757 10.8349 10.8821 8.6942 3.5751 5.7977 5.4736 7.0336 6.8414 4.4889 5.2260 8.8318 12.8781 5.2044 1.3008 3.7319 1.4697 1.3952 7.4586 4.8955 4.8069 1.8940 1.2622 7.9210 2.7748 1.3185 5.7907 1.1002 3.8004 3.0373 3.3463 1.8146 6.0549 2.4339 3.3947 10.4413 4.4504 4.2901 2.7457 1.2407 1.1379 1.0412 1.0826 8.0798 5.9247 6.8950 11.5005 1.0577 1.0327 1.1048 1.0883 1.1022 1.1023 1.0952 1.1046
irintensity: 3.5441 0.0054 3.1975 1.0140 1.9236 0.6005 3.1321 1.0129 19.3889 3.6459 4.6947 0.4846 1.6830 2.9343 6.4706 10.3566 1.1343 4.8722 4.2128 13.6346 13.4722 1.6378 0.5160 2.4350 0.1615 11.9121 1.2853 30.1391 12.0147 17.2753 13.3519 58.0246 2.9608 36.9465 0.9249 8.3364 0.2089 100.0245 0.1482 51.3527 0.2344 111.8504 0.2177 155.4723 1.8376 40.5798 311.5352 77.5499 331.7062 488.2149 183.9871 83.8942 97.7987 281.9727 154.8261 256.4298 116.5708 73.6889 21.6871 50.9939 47.5895 75.6104 60.7850 479.2415 7.9903 16.9113 2.3610 21.7155 10.3688 1.4478 0.0986 6.2868
temp: 298.150 k
press: 1.00000 atm
elementType: 16 8 8 8 8 7 7 7 7 6 6 6 6 6 6 6 6 6 1 1 1 1 1 1 1 1
symmnumber: 1
zpe: 457008.4 jmol-1
zpe.correction: 0.174065 hartree
zpe.thermalcorrener: 0.190574 hartree
zpe.thermalcorrenthalpy: 0.191518 hartree
zpe.thermalcorrgfe: 0.127632 hartree
zpe.sumelectzpe: -1264.288113 hartree
zpe.sumelectthermal: -1264.271605 hartree
zpe.sumelectthermalent: -1264.270661 hartree
zpe.sumelectthermalfe: -1264.334547 hartree
dipole: 5.0865 1.0520 -0.0012
dipole: 5.1942
quadrupole: -145.4214 -119.8128 -108.4959
quadrupole: -9.6070 0.0093 0.0070
quadrupole: -20.8447 4.7639 16.0808 -9.6070 0.0093 0.0070
hfenergy: -1264.4621785 hartree
pointgroup: C01[X(C9H8N4O4S1)]
dipole: -1.9957502 -0.4393977 -0.000484 debye
dipolederiv: -0.3006321 -0.0445579 0.0000523 -0.4086186 -0.774871 0.0001416 0.000365 0.0006638 -0.1408153 -0.9023852 0.4777761 -0.0004361 0.603306 -1.1199888 0.0006401 0.0009474 -0.0013305 -0.3312296 0.1341632 0.071863 0.0000317 -0.0704149 -0.5318796 0.0000323 0.0001732 0.0000953 -0.086922 -1.3050202 0.0697496 -0.0001326 0.3630952 -0.4825145 0.0000499 -0.0004565 0.0000919 -0.239851 -0.5768002 -0.0891665 -0.0000537 -0.6234045 -0.8443188 0.000082 -0.0001289 -0.0000405 -0.2230189 -2.6252096 -0.3640596 0.0001519 -0.147216 -0.4038068 0.0002638 -0.0001591 0.0000333 -0.0825598 -1.091652 0.0928911 0.0001226 0.9148869 -1.5707013 0.0002132 0.000075 0.0003608 -0.1132368 1.6907033 0.1709355 0.0001584 -0.3947 -0.2370002 -0.0000026 0.0006099 -0.0000819 -0.0766178 2.6511064 0.3116352 0.000339 0.856816 1.2708151 -0.0000621 0.0006583 -0.0000558 0.2076832 -0.4446217 -0.0428311 0.0001276 -0.2326526 0.2113308 -0.0001666 -0.0004057 -0.0002299 0.3027556 0.9121545 -0.1323933 0.0002358 -0.8144601 1.9359192 -0.0008184 -0.0000694 0.0007876 0.1913335 2.2968739 -0.0845601 -0.0002251 0.8001984 1.6629283 -0.0003388 -0.0010087 -0.0002045 -0.0735748 0.4402629 0.0705063 -0.0001988 0.1024662 0.0742884 -0.0000198 -0.0001728 -0.0000071 0.1821974 0.5930042 -0.0002545 0.0000096 -0.4318975 0.1785654 -0.0000499 0.0001655 0.0000299 0.0561398 -0.4998533 -0.1051656 0.0000216 -0.6374188 0.245342 -0.0001602 -0.0002398 -0.0001104 -0.1060985 -0.5133513 -0.00416 -0.0000506 0.5350703 -0.0089468 0.000048 -0.0001196 -0.0000351 -0.1581339 -1.4233017 -0.3610251 -0.000153 -0.8022734 -0.0135343 -0.0001203 -0.0002603 -0.0000665 0.079469 0.4929605 0.0469145 0.0000826 0.2722886 0.0929864 0.0000325 0.0001062 -0.0000083 -0.1058497 0.0489529 -0.0410355 0.0507359 0.0499513 0.0180986 0.0212177 0.0341307 0.0601428 0.0143656 0.0487729 -0.0409903 -0.0506551 0.0500651 0.0181175 -0.0210563 -0.034072 -0.0601114 0.014444 0.0532594 -0.0091778 0.0222341 -0.0841823 0.0544304 -0.0850799 -0.0222181 -0.0658068 -0.0217159 0.076881 0.0149592 0.000038 0.1551264 0.0226742 0.0000352 0.0000031 0.0000804 0.138414 0.0530905 -0.0090729 -0.02237 -0.0838337 0.0546377 0.0850354 0.0221569 0.0657009 -0.0220114 0.0358852 0.0234305 -0.0000352 0.074008 -0.0652943 0.0000579 -0.0000457 0.0000666 0.2062519 0.0752253 -0.0609587 -0.0000085 -0.0539202 0.0951171 0.0000124 -0.0000086 0.0000081 0.191263 0.0795312 0.0387479 -0.0000223 0.0077143 0.1176054 0.0000128 -0.0000261 0.0000272 0.1973187 unknown
polarizability: 397.397016|13.8624651|189.6908442|0.0060365|-0.0307125|67.3246778 unknown
InChI: InChI=1S/C9H8N4O4S/c1-11-7(14)5-12(9(11)18)10-4-6-2-3-8(17-6)13(15)16/h2-4H,5H2,1H3
charge 0 multiplicity 1
26 atoms
S  -3.222249 -2.50494 0.00058
O  -4.665207 2.399316 0.000174
O  2.688941 0.575686 -0.000051
O  6.155742 -0.333314 0.000929
O  5.143715 1.736192 0.000394
N  -2.005723 0.006699 -0.00089
N  -4.256882 0.05836 -0.000056
N  -0.757715 -0.540102 -0.000456
N  5.112476 0.443229 0.00037
C  -2.354713 1.44701 -0.000979
C  -3.888263 1.418592 -0.001334
C  -3.151514 -0.825297 -0.000763
C  -5.650528 -0.399848 0.001669
C  1.605782 -0.330118 -0.000099
C  0.293944 0.266529 -0.000377
C  2.090552 -1.648471 0.000166
C  3.841458 -0.217511 0.000248
C  3.516949 -1.57381 0.000309
H  -1.974443 1.966216 -0.900553
H  -1.974616 1.966205 0.898683
H  -5.849555 -1.013847 -0.892128
H  -6.293346 0.494068 0.001481
H  -5.84798 -1.012313 0.896873
H  0.256832 1.3681 -0.000599
H  1.467707 -2.539619 0.000208
H  4.232635 -2.391614 0.000502
