program: Gaussian 09
title: 000113820
version: EM64L-G09RevD.01
frameworkgroup: C1[X(C14H12N2O)]
method: RPBEPBE
basis: SDD
operation: Freq
keyword: #p
keyword: freq=noraman
keyword: PBEPBE/SDD
title: #p freq=noraman PBEPBE/SDD
converged: YES YES NO NO
title: Mulliken charges:
elementType: O N N C C C C C C C C C C C C C C H H H H H H H H H H H H
charge: -0.275749 -0.415348 -0.091197 0.473069 -0.221373 -0.368921 -0.384080 0.175832 -0.389709 -0.235278 -0.234542 0.217602 -0.233676 -0.286406 -0.181101 -0.185380 -0.339759 0.264130 0.225461 0.237879 0.210927 0.322079 0.229582 0.231913 0.310794 0.233343 0.238313 0.232070 0.239526
chargesum: 0.00000
title: Mulliken charges with hydrogens summed into heavy atoms:
elementType: O N N C C C C C C C C C C C C C C
charge: -0.275749 -0.093269 -0.091197 0.473069 0.042756 -0.143459 -0.146201 0.175832 -0.178782 -0.005697 -0.002629 0.217602 -0.000333 0.024388 0.057212 0.046690 -0.100233
polarizability: 3.80266095e+02 -5.77902202e+00 1.62797711e+02 -4.16243125e-02 4.03853459e-02 6.43810718e+01
1716.lowfreq: -0.0012 -0.0010 -0.0006 2.4107 5.5010 11.4004 28.8049 37.2081 53.0664
frequency: 28.5685 36.6297 53.0263 82.6953 102.2992 148.2291 154.9495 210.4069 256.1350 270.4017 283.1251 346.2322 403.5670 412.5708 453.0110 489.2052 516.7725 553.9171 606.7312 615.9500 624.2594 678.7558 700.6159 703.6209 746.7718 751.4541 775.4377 789.5230 832.7653 847.5538 860.1057 878.9619 906.0139 926.8919 951.7597 957.7272 980.2099 985.6333 990.3110 997.5557 1006.8210 1013.2645 1026.7738 1037.4244 1083.9934 1087.7840 1148.2180 1161.5186 1174.7329 1191.3372 1219.1528 1252.6008 1290.7524 1298.3938 1321.0573 1335.3704 1349.1638 1387.2435 1412.2985 1440.8587 1447.0929 1486.0290 1495.1900 1567.5628 1581.4676 1582.5019 1586.5633 1611.7169 1652.5410 3098.2693 3113.0321 3124.6854 3128.9717 3133.8614 3141.0290 3146.0514 3151.9314 3167.6107 3172.7938 3198.3655 3506.8919
redmass: 5.0463 4.4142 5.3857 4.4739 6.7236 5.2725 3.2194 6.8623 3.2859 6.3614 3.6780 8.0357 2.7590 3.6071 5.0009 2.7925 2.6586 6.6292 7.2768 6.5419 6.4130 3.9164 1.7360 1.2637 6.7671 1.9751 1.9561 1.8884 5.1369 1.2881 4.5979 1.8293 1.2977 1.4339 6.5256 1.4328 1.3855 5.7849 5.9969 1.3104 1.3102 1.2349 2.1996 2.2145 1.6033 1.6159 2.0430 1.0958 1.0664 1.1224 1.6158 2.0960 1.7933 2.1157 1.8347 1.2948 3.3661 7.0339 2.0013 2.3075 2.4158 2.3103 2.3773 7.0667 6.0059 5.3990 5.3039 5.9720 5.5605 1.0909 1.0896 1.0862 1.0868 1.0883 1.0916 1.0911 1.0964 1.1016 1.0990 1.0964 1.0759
irintensity: 0.8256 0.6699 0.3460 1.7349 3.9843 3.7953 1.1560 1.6966 3.3596 9.8440 0.5305 0.9026 0.0181 3.1328 6.2310 22.0560 9.4389 38.8872 1.7650 1.0755 0.4456 3.2266 50.1734 52.2026 4.2660 9.8794 47.0435 112.5695 0.9054 1.1075 0.5771 26.0810 2.4732 0.0093 13.6007 3.0778 0.4470 6.1632 0.0115 6.9849 1.9709 40.5957 3.7402 6.6664 12.3506 11.1970 206.5506 2.4398 2.1766 13.8627 17.6506 3.0100 94.1333 24.3843 16.8946 29.2548 42.6259 15.9516 239.5081 40.4494 64.2543 0.7978 724.4269 71.7577 252.5370 6.8559 68.5752 0.7794 75.6016 0.1661 14.9965 5.7643 1.2769 15.8365 6.3233 16.6308 38.4958 33.1686 28.8066 10.0867 33.5017
temp: 298.150 k
press: 1.00000 atm
elementType: 8 7 7 6 6 6 6 6 6 6 6 6 6 6 6 6 6 1 1 1 1 1 1 1 1 1 1 1 1
symmnumber: 1
zpe: 593606.6 jmol-1
zpe.correction: 0.226093 hartree
zpe.thermalcorrener: 0.240220 hartree
zpe.thermalcorrenthalpy: 0.241165 hartree
zpe.thermalcorrgfe: 0.183053 hartree
zpe.sumelectzpe: -724.244036 hartree
zpe.sumelectthermal: -724.229909 hartree
zpe.sumelectthermalent: -724.228965 hartree
zpe.sumelectthermalfe: -724.287076 hartree
dipole: 1.2338 1.4443 0.0055
dipole: 1.8995
quadrupole: -67.6317 -94.1337 -106.0132
quadrupole: 2.9959 -0.0428 0.0547
quadrupole: 21.6279 -4.8742 -16.7537 2.9959 -0.0428 0.0547
hfenergy: -724.470129 hartree
pointgroup: C01 [X(C14H12N2O1)]
dipole: -0.4785297 -0.5737359 -0.0186673 debye
polarizability: 380.3675036|-3.0979326|162.5340714|-1.535299|3.912318|64.5433028 unknown
InChI: InChI=1S/C14H12N2O/c17-14(16-13-8-4-5-11-15-13)10-9-12-6-2-1-3-7-12/h1-11,16H
charge 0 multiplicity 1
29 atoms
O  0.844921 1.713605 0.071866
N  1.713169 -0.46966 -0.025255
N  3.837557 -1.383229 -0.078399
C  -3.212089 0.157748 0.023185
C  -1.81179 0.600122 0.03363
C  -3.600934 -1.213833 -0.020476
C  -4.236468 1.147784 0.059547
C  3.103517 -0.227447 -0.020758
C  -0.686781 -0.176683 -0.000325
C  -4.961437 -1.5755 -0.027181
C  -5.599529 0.786109 0.052711
C  0.659308 0.455588 0.019343
C  -5.96793 -0.578281 0.009338
C  3.687473 1.067167 0.037307
C  5.095113 1.146178 0.03444
C  5.871928 -0.035698 -0.0250
C  5.194141 -1.274705 -0.07992
H  -1.636227 1.685706 0.073595
H  -2.837426 -1.999218 -0.048435
H  -3.951684 2.206456 0.093579
H  -0.743451 -1.27245 -0.042075
H  1.492635 -1.469888 -0.069104
H  -5.244082 -2.633553 -0.060686
H  -6.371272 1.562905 0.081186
H  3.04406 1.947056 0.081605
H  -7.025472 -0.864308 0.00407
H  5.580329 2.12703 0.078583
H  6.965295 -0.002529 -0.028774
H  5.746225 -2.220072 -0.127097
