program: Gaussian 09
title: 000113875
version: EM64L-G09RevD.01
frameworkgroup: C1[X(C22H29NO5)]
method: RPBEPBE
basis: SDD
operation: Freq
keyword: #p
keyword: freq=noraman
keyword: PBEPBE/SDD
title: #p freq=noraman PBEPBE/SDD
converged: YES YES NO NO
title: Mulliken charges:
elementType: O O O O O N C C C C C C C C C C C C C C C C C C C C C C H H H H H H H H H H H H H H H H H H H H H H H H H H H H H
charge: -0.259959 -0.442757 -0.311023 -0.329500 -0.241990 -0.310575 -0.430637 -0.088144 -0.348800 -0.596716 -0.263179 0.573090 -0.546570 -0.415449 0.237561 -0.361679 0.220859 0.359590 -0.390530 -0.324079 0.300387 -0.359795 -0.340300 0.103234 -0.494261 -0.524187 -0.690016 -0.535504 0.255422 0.185104 0.176585 0.194981 0.230922 0.206533 0.209731 0.242701 0.231168 0.232407 0.253344 0.229442 0.334497 0.246047 0.252916 0.241447 0.278711 0.248071 0.229156 0.249043 0.249431 0.228226 0.237924 0.223532 0.205174 0.231927 0.257503 0.223315 0.225669
chargesum: 0.00000
title: Mulliken charges with hydrogens summed into heavy atoms:
elementType: O O O O O N C C C C C C C C C C C C C C C C C C C C C C
charge: -0.259959 -0.108260 -0.311023 -0.329500 -0.241990 -0.067874 0.009889 0.088440 0.077103 -0.180452 0.200396 0.573090 -0.293226 -0.186007 0.237561 -0.115632 0.220859 0.359590 -0.137614 -0.082633 0.300387 -0.081084 -0.092228 0.103234 -0.016061 0.191395 -0.029384 0.170984
polarizability: 3.70825986e+02 -4.03267283e+00 1.94667508e+02 -4.50476686e+00 -8.05791675e+00 2.25475913e+02
1716.lowfreq: -9.0766 -5.5341 -3.0242 -0.0001 0.0007 0.0010 6.0982 12.3578 29.0970
frequency: 2.2605 11.2358 28.8711 36.5593 49.2179 53.3825 60.0144 68.2333 81.4902 88.2701 101.3949 110.3350 114.8631 116.7682 141.9955 144.0954 155.0886 159.5413 164.6269 174.7560 181.3367 195.9292 215.9083 230.6592 242.2896 264.0119 281.5389 287.8654 295.6458 303.5975 314.4845 341.8330 348.5537 380.3020 411.6120 422.1868 436.5962 446.9038 456.4610 477.3489 487.1658 492.9784 523.3963 559.5799 569.0260 573.4971 627.7466 637.6487 642.2054 657.0516 694.2145 710.1515 722.7693 731.2400 746.6330 795.5695 807.8072 817.8938 829.2862 842.8265 851.5931 856.0347 876.9350 899.0465 916.0361 937.6753 943.8604 945.5994 948.7761 949.3925 960.6574 979.0974 993.9072 1001.7101 1002.4147 1018.7205 1023.7597 1059.8817 1070.6100 1077.2574 1089.4195 1091.3361 1105.2038 1112.2738 1114.7107 1117.0910 1139.4354 1149.1829 1153.1305 1154.1100 1157.6362 1183.6848 1193.3223 1213.3886 1231.1562 1235.2278 1237.9585 1242.9077 1250.5708 1253.9476 1265.2634 1268.1685 1296.1999 1303.3013 1323.7243 1335.6703 1343.4041 1367.4881 1370.3326 1376.5154 1382.4515 1394.8913 1398.8038 1405.4867 1424.8545 1431.3631 1441.0960 1445.0437 1448.3336 1450.0157 1453.2682 1457.3327 1466.1393 1468.1776 1473.6738 1474.8387 1478.4302 1482.0535 1486.3157 1487.6988 1500.2168 1554.5643 1575.2970 1589.6402 1612.1906 1619.7113 2840.8618 2872.1756 2909.1438 2964.0957 2971.3084 2978.9185 2983.0663 2988.6943 2993.8751 3010.7036 3024.9087 3040.7879 3058.8881 3064.4207 3068.9554 3081.5926 3088.6313 3097.8237 3117.2576 3128.2730 3130.6237 3137.0800 3146.1978 3151.7613 3156.4049 3167.5025 3175.9592 3443.8519 3553.3647
redmass: 4.4717 6.0378 4.6127 4.6539 5.4148 5.7202 3.8207 3.3552 4.1494 4.3371 2.7046 3.0260 2.4488 3.0481 4.0141 2.9290 1.2213 2.2271 1.3069 2.7937 3.6798 1.3280 2.3483 2.2385 1.5330 4.6237 4.6650 4.6197 3.2440 2.5089 3.9120 4.3473 3.9403 4.4636 2.9754 3.5530 3.5438 4.8078 4.4367 4.2518 2.9059 3.5537 3.3349 4.4118 2.1094 4.9259 6.7330 1.4724 3.5272 3.1660 4.1713 5.0120 3.8585 3.1114 3.3753 1.4763 4.6462 1.3692 1.4531 2.9137 2.8282 1.5692 2.4071 1.5998 2.4814 3.3241 4.9671 1.6128 1.8072 2.2700 2.4308 3.2377 1.3463 2.5203 2.2764 1.5700 3.2879 1.8462 1.6563 2.3808 2.5117 2.6217 1.9349 1.2410 1.2394 1.2778 1.4929 2.5077 1.3673 1.4209 1.4235 1.3114 1.7635 1.1946 1.3691 2.4038 2.4173 2.3047 1.2283 1.3481 1.6820 1.2345 1.1867 1.3183 1.4407 2.0286 1.3423 6.1571 2.1185 1.8618 1.4297 1.2127 2.2825 1.8554 1.1744 3.1093 1.3347 1.1910 1.1533 1.2102 1.0605 1.0674 1.0948 1.0397 1.1339 1.0622 1.0553 1.4456 1.7234 1.0583 2.4744 6.8206 7.2699 7.8826 6.7978 6.2674 1.0718 1.0712 1.0821 1.0603 1.0308 1.0613 1.0306 1.0560 1.0364 1.0983 1.0908 1.0984 1.1079 1.0874 1.1038 1.1034 1.1001 1.0996 1.1031 1.1034 1.0877 1.0914 1.0879 1.0879 1.0967 1.0965 1.0955 1.0741 1.0658
irintensity: 0.1312 0.1621 2.2543 0.2165 1.5690 0.8960 0.2492 3.4761 0.9054 2.6913 4.3815 5.1989 1.8681 1.4789 2.1996 1.5942 0.6983 0.6817 1.0883 3.0478 1.8881 0.0568 35.6997 48.1925 73.3098 16.0585 8.2730 8.7269 0.7345 0.1493 6.4331 0.8505 6.4602 6.6803 0.6913 7.3424 6.7563 1.2200 9.7818 11.2037 8.4581 10.5890 1.6606 11.5595 8.8818 9.0804 1.8781 62.8794 48.1922 18.9143 3.8972 9.4853 10.5294 1.0825 2.4959 66.9276 5.1702 0.4429 43.9736 1.6550 14.6987 47.9293 4.8260 23.2231 64.7614 27.7618 73.8462 20.4911 6.3287 7.3604 26.6799 36.8984 0.3191 2.0157 3.3408 11.7500 1.9632 5.3647 0.8915 106.8817 23.3733 8.9971 10.2275 5.5717 6.2563 22.8976 3.5387 28.6235 0.2962 26.0440 54.8294 180.0667 46.0197 67.6852 4.6602 121.4177 120.6996 105.6022 9.8172 14.6523 61.3663 6.1032 19.2317 0.3960 9.6089 75.6093 12.3549 5.7307 12.5743 5.8670 5.7026 33.6168 21.9939 10.9625 0.7071 45.6875 6.4789 30.3631 5.6409 27.7945 18.6258 7.1865 9.8512 10.7192 4.8056 14.2329 10.5186 29.9019 75.7040 31.2207 20.4499 179.7229 4.9316 97.4078 5.5988 145.6584 163.1586 176.6474 64.7275 24.7946 79.5900 55.4054 38.5427 39.1055 37.1826 7.8944 24.6350 30.4974 15.6570 13.3642 25.2247 22.7893 29.0618 32.3917 22.9902 25.7849 10.7061 6.7753 0.0977 8.1379 9.9264 8.0716 9.1412 0.2682 3.6407
temp: 298.150 k
press: 1.00000 atm
elementType: 8 8 8 8 8 7 6 6 6 6 6 6 6 6 6 6 6 6 6 6 6 6 6 6 6 6 6 6 1 1 1 1 1 1 1 1 1 1 1 1 1 1 1 1 1 1 1 1 1 1 1 1 1 1 1 1 1
symmnumber: 1
zpe: 1229788.0 jmol-1
zpe.correction: 0.468402 hartree
zpe.thermalcorrener: 0.498424 hartree
zpe.thermalcorrenthalpy: 0.499368 hartree
zpe.thermalcorrgfe: 0.403053 hartree
zpe.sumelectzpe: -1284.427405 hartree
zpe.sumelectthermal: -1284.397382 hartree
zpe.sumelectthermalent: -1284.396438 hartree
zpe.sumelectthermalfe: -1284.492753 hartree
dipole: 5.3933 3.5799 -2.6495
dipole: 6.9945
quadrupole: -144.9527 -182.0467 -160.2523
quadrupole: -3.2625 11.0152 0.3413
quadrupole: 17.4646 -19.6295 2.1649 -3.2625 11.0152 0.3413
hfenergy: -1284.895806 hartree
pointgroup: C01 [X(C22H29N1O5)]
dipole: -1.9942678 -1.4309129 -1.2442064 debye
polarizability: 370.2755774|9.2251872|193.536529|6.2418606|4.5137769|227.1573004 unknown
InChI: InChI=1S/C22H29NO5/c1-4-20(25)17-6-8-19(9-7-17)28-15-18(24)14-23-12-11-16-5-10-21(26-2)22(13-16)27-3/h5-10,13,18,23-24H,4,11-12,14-15H2,1-3H3
charge 0 multiplicity 1
57 atoms
O  -2.26392 2.031159 0.302958
O  -5.030839 2.734855 -0.193398
O  1.83935 -2.604935 1.229522
O  2.351802 -1.549681 -1.470104
O  3.997469 2.306414 1.711415
N  -4.174889 -0.945165 -0.103394
C  -4.630555 0.346475 0.437406
C  -4.444646 1.460084 -0.622801
C  -3.762304 -1.982263 0.863074
C  -2.977797 -3.130831 0.16767
C  -2.974324 1.70511 -0.946779
C  -1.577038 -2.735818 -0.275342
C  -0.49441 -2.834273 0.633478
C  -1.317971 -2.229832 -1.574529
C  0.811142 -2.439864 0.272624
C  -0.011049 -1.852416 -1.954896
C  1.062038 -1.961189 -1.045386
C  -0.871945 2.071625 0.266901
C  -0.235958 2.390477 1.498479
C  -0.089831 1.80401 -0.886625
C  1.966584 2.112983 0.434515
C  1.162282 2.409312 1.574974
C  1.314171 1.820628 -0.791553
C  3.453945 2.086855 0.584127
C  4.311022 1.767492 -0.649266
C  2.506228 -1.352199 1.659847
C  5.817942 1.726635 -0.344732
C  3.357488 -2.638861 -1.50539
H  -4.016386 0.601618 1.318243
H  -5.701747 0.34388 0.767861
H  -4.92528 1.125496 -1.573334
H  -4.625767 -2.427988 1.416048
H  -3.109227 -1.50417 1.61688
H  -3.57078 -3.490336 -0.697089
H  -2.918511 -3.974042 0.882675
H  -4.807095 -1.320275 -0.822747
H  -2.565777 0.770968 -1.376499
H  -2.87283 2.54695 -1.658125
H  -0.644556 -3.21591 1.650261
H  -2.139578 -2.142556 -2.294085
H  -5.92483 2.564256 0.198997
H  0.204104 -1.482224 -2.963141
H  -0.862168 2.611225 2.368313
H  -0.560017 1.562461 -1.843107
H  1.671859 2.645069 2.515333
H  1.898697 1.574292 -1.68308
H  4.094792 2.525918 -1.429872
H  3.968319 0.800352 -1.072065
H  2.994712 -0.850496 0.806649
H  3.252816 -1.660053 2.406957
H  1.771291 -0.663887 2.115884
H  6.047005 0.955139 0.410783
H  6.394374 1.50615 -1.261461
H  6.163108 2.690139 0.067208
H  3.464626 -3.109632 -0.511728
H  3.063646 -3.401174 -2.251759
H  4.301013 -2.159958 -1.809799
