program: Gaussian 09
title: 000008396
version: EM64L-G09RevD.01
frameworkgroup: C1[X(C12H16O)]
method: RPBEPBE
basis: SDD
operation: Freq
keyword: #pfreq=noraman
keyword: PBEPBE/SDD
title: #p freq=noraman PBEPBE/SDD
converged: NO YES NO YES
title: Mulliken charges:
elementType: O C C C C C C C C C C C C H H H H H H H H H H H H H H H H
charge: -0.444774 -0.183376 -0.441894 -0.441898 -0.397418 -0.397419 -0.384074 0.396714 0.077397 -0.369975 -0.395104 -0.276972 -0.219080 0.253103 0.215226 0.190810 0.190801 0.215224 0.194633 0.197194 0.197193 0.194632 0.186432 0.197778 0.229884 0.212229 0.223296 0.225116 0.354320
chargesum: 0.00000
title: Mulliken charges with hydrogens summed into heavy atoms:
elementType: O C C C C C C C C C C C C
charge: -0.090454 0.069728 -0.035858 -0.035873 -0.005591 -0.005594 0.000135 0.396714 0.077397 -0.140091 -0.182875 -0.053675 0.006037
polarizability: 1.66086230e+02 -2.43064653e+00 1.28329366e+02 2.26775089e-03 -3.57840054e-03 8.77994082e+01
1716.lowfreq: -12.3308 -0.0008 -0.0006 -0.0001 14.4559 15.9151 26.2777 86.4878 88.2780
frequency: 25.2306 86.4287 88.2689 195.5467 205.2901 225.4112 242.5931 318.7017 334.3021 351.7384 410.3854 425.6694 475.0991 478.9453 492.4937 536.6648 557.8783 614.4976 737.9556 751.4536 756.4520 782.7686 791.7089 831.1200 839.3803 858.8533 888.9348 890.5608 914.6395 933.2195 969.7913 989.2408 1041.0968 1047.4477 1052.1622 1065.8666 1069.4862 1110.5775 1131.4789 1155.9088 1170.1844 1180.7409 1196.0652 1231.1823 1240.3267 1257.9070 1261.8639 1283.3126 1307.5562 1322.9186 1333.2520 1335.3644 1339.9774 1346.2158 1361.1439 1395.1981 1438.5052 1459.2575 1460.8856 1462.0741 1468.2149 1476.0338 1492.0981 1601.1826 1612.0538 2960.8322 2962.7050 2963.9291 2964.6900 2966.6189 3006.4004 3021.4140 3022.7978 3030.3834 3031.5793 3044.0612 3103.5763 3119.9300 3139.0204 3162.1949 3580.8853
redmass: 3.3818 3.9353 3.2541 4.1409 3.0108 1.7807 4.8187 3.1658 1.8291 1.1744 3.0583 3.0170 3.1238 1.7422 3.4178 4.5322 3.7434 4.8450 2.9847 1.4278 2.6480 1.4524 4.5771 3.5783 1.4237 1.6224 1.5272 2.5379 1.7230 1.4785 1.3159 2.4798 2.1217 1.8095 1.3379 2.3473 1.2592 2.4537 1.9954 1.3178 1.0749 1.4986 1.8173 1.8235 1.7849 1.2708 1.3990 1.5170 1.2867 1.3245 1.3580 1.3121 1.4666 1.4588 1.5558 5.2778 2.2981 1.0890 1.0927 1.0901 1.0857 1.1091 2.5213 6.3404 6.7105 1.0617 1.0615 1.0605 1.0617 1.0667 1.0845 1.0977 1.0945 1.1007 1.1029 1.1015 1.0886 1.0874 1.0919 1.1003 1.0659
irintensity: 0.3147 1.6197 0.2886 0.0633 1.9497 0.1340 0.1558 15.3163 0.9914 116.6145 6.3686 0.8699 12.7848 0.5596 5.6203 4.5676 0.0026 1.9304 13.1407 84.5983 0.9709 0.0114 15.0457 11.7957 0.0695 6.4649 11.4803 2.9272 0.0002 0.2735 0.0051 16.2642 9.8241 0.1520 0.0228 67.3701 0.0338 0.0003 49.5936 49.2735 2.9014 0.5141 25.7241 10.8531 25.1145 1.6824 3.6734 19.1407 0.0962 9.8120 0.2418 0.1302 0.2345 0.4550 2.1919 9.1423 33.7230 1.2619 5.7820 9.9952 16.9165 3.3693 35.1043 16.1385 4.2992 34.2530 15.5444 67.9172 40.0998 1.6114 18.6061 92.4476 70.8010 12.1893 5.8555 117.9228 18.8613 8.5962 24.3234 25.9290 25.1295
temp: 298.150 k
press: 1.00000 atm
elementType: 8 6 6 6 6 6 6 6 6 6 6 6 6 1 1 1 1 1 1 1 1 1 1 1 1 1 1 1 1
symmnumber: 1
zpe: 656688.7 jmol-1
zpe.correction: 0.250120 hartree
zpe.thermalcorrener: 0.261863 hartree
zpe.thermalcorrenthalpy: 0.262808 hartree
zpe.thermalcorrgfe: 0.211952 hartree
zpe.sumelectzpe: -541.122060 hartree
zpe.sumelectthermal: -541.110317 hartree
zpe.sumelectthermalent: -541.109372 hartree
zpe.sumelectthermalfe: -541.160228 hartree
dipole: 1.0177 0.5277 0.0001
dipole: 1.1463
quadrupole: -70.0502 -71.4743 -82.6465
quadrupole: 5.4305 0.0000 -0.0011
quadrupole: 4.6735 3.2494 -7.9229 5.4305 0.0000 -0.0011
hfenergy: -541.37218 hartree
pointgroup: C01 [X(C12H16O1)]
dipole: -0.398409 0.2113729 -0.0000966 debye
polarizability: 166.1285614|2.0755609|128.2870312|-0.0034211|-0.012597|87.7994118 unknown
InChI: InChI=1S/C12H16O/c13-12-9-5-4-8-11(12)10-6-2-1-3-7-10/h4-5,8-10,13H,1-3,6-7H2
charge 0 multiplicity 1
29 atoms
O  -1.209625 2.32495 -0.000518
C  0.810132 0.301061 -0.000031
C  1.524912 -0.233533 -1.27568
C  1.52518 -0.233219 1.275589
C  3.029313 0.129531 -1.275989
C  3.029582 0.129854 1.275491
C  3.736689 -0.386794 -0.000258
C  -0.678938 -0.034039 0.00013
C  -1.667457 0.98844 -0.000149
C  -1.138872 -1.374632 0.000496
C  -3.050204 0.684911 -0.000048
C  -2.514119 -1.698322 0.000592
C  -3.474076 -0.661215 0.000322
H  0.907714 1.40342 -0.000181
H  1.029064 0.1756 -2.177187
H  1.414923 -1.336931 -1.323097
H  1.41523 -1.336607 1.323313
H  1.029531 0.176124 2.177108
H  3.136243 1.232959 -1.329617
H  3.517839 -0.284255 -2.180152
H  3.518309 -0.283699 2.179652
H  3.136521 1.233297 1.328814
H  3.72408 -1.497066 -0.000115
H  4.800632 -0.078393 -0.000406
H  -0.39783 -2.183429 0.000706
H  -3.791222 1.496259 -0.00026
H  -2.833908 -2.745745 0.000883
H  -4.544725 -0.893618 0.000398
H  -1.974516 2.952193 -0.000705
