program: Gaussian 09
title: 000113697
version: EM64L-G09RevD.01
frameworkgroup: C1[X(C11H17N3S)]
method: RPBEPBE
basis: SDD
operation: Freq
keyword: #p
keyword: freq=noraman
keyword: PBEPBE/SDD
title: #p freq=noraman PBEPBE/SDD
converged: YES YES NO NO
title: Mulliken charges:
elementType: S N N N C C C C C C C C C C C H H H H H H H H H H H H H H H H H
charge: 0.138963 -0.073685 -0.607340 -0.345124 -0.666403 -0.344129 0.543976 -0.389726 -0.366069 -0.621772 -0.613616 -0.234887 -0.242340 -0.243685 -0.057761 0.367054 0.218103 0.218897 0.245429 0.248263 0.244225 0.192522 0.213144 0.223379 0.188833 0.220455 0.221230 0.220415 0.224429 0.318033 0.329119 0.230071
chargesum: 0.00000
title: Mulliken charges with hydrogens summed into heavy atoms:
elementType: S N N N C C C C C C C C C C C
charge: 0.138963 -0.073685 0.039812 -0.115052 -0.299350 0.092871 0.543976 -0.144297 -0.117805 0.028118 0.019050 -0.013658 -0.021925 -0.019256 -0.057761
polarizability: 2.03291020e+02 -2.64914557e+00 1.48552018e+02 -1.00447173e+01 -7.14820951e+00 1.27618316e+02
1716.lowfreq: -5.0563 -0.0019 -0.0018 0.0002 5.9049 6.1510 16.8805 30.7914 33.7317
frequency: 16.4283 30.4641 33.6651 35.6378 68.2128 73.6381 144.3861 167.7654 193.7616 230.6058 231.2796 250.7938 261.1785 303.3040 340.2013 358.1442 385.7205 401.5837 409.5327 448.5991 458.1814 485.9738 503.7277 556.0076 578.4766 592.4486 617.3354 687.4980 699.6905 716.7796 768.9718 785.8579 823.8003 847.6828 921.5365 972.6019 977.1700 986.1914 991.5673 992.5670 1017.0831 1030.1351 1036.7651 1043.7202 1068.6129 1087.3105 1099.7797 1135.1412 1170.7720 1174.2819 1192.3488 1221.7530 1232.8695 1263.5909 1278.5814 1285.1376 1322.3079 1358.6393 1372.1284 1390.6978 1419.5521 1441.0393 1446.0939 1459.9996 1464.7460 1474.1752 1478.1998 1485.6193 1486.6559 1592.3320 1611.7852 1612.9808 1640.7423 2845.6915 2860.4344 2872.0880 2977.1059 3013.5705 3017.7825 3032.1666 3073.5416 3087.5029 3117.1143 3125.2966 3138.8204 3154.9595 3169.9356 3381.1590 3524.1543 3672.7104
redmass: 5.2917 2.6969 3.7187 4.5263 3.5111 4.4708 5.1061 2.6840 3.1955 1.1217 1.7567 2.9925 3.8399 3.0427 1.0471 2.0369 3.5287 2.7799 1.2630 2.4050 6.5470 3.6654 4.2750 2.9780 3.0079 3.5103 6.1193 5.1686 1.4812 1.4436 4.1414 2.2964 3.7039 1.2819 1.4811 1.4127 1.7387 2.1256 1.3299 4.0868 2.4017 2.0916 1.5804 1.6083 2.1005 1.3307 1.8192 1.4251 1.1249 1.6720 1.1279 2.3905 1.3067 2.4584 1.9335 1.9070 1.3168 1.3527 1.8591 2.9311 1.1519 1.8441 1.2625 1.0538 1.0700 1.0834 1.0536 1.5014 1.3645 5.9964 2.1259 2.2817 3.3969 1.0577 1.0644 1.0616 1.0858 1.0720 1.0877 1.0737 1.1010 1.1008 1.0849 1.0880 1.0937 1.0977 1.0971 1.0773 1.0447 1.1044
irintensity: 0.4808 0.5379 0.8061 10.8598 1.0998 2.3781 2.8828 2.9932 1.7527 0.2434 0.7598 3.2857 2.5555 3.8475 21.7371 3.9241 4.9381 1.5826 273.5810 0.9490 4.1059 4.3658 19.3155 23.1765 46.4875 42.0919 0.9698 32.6892 93.4994 80.2270 14.4350 22.6186 8.9982 0.8415 3.1011 1.7826 121.8006 25.8056 0.3385 3.5374 38.4126 5.3502 19.3457 3.7961 13.8490 8.7177 1.6333 5.3298 1.9296 12.4492 1.7010 8.8305 5.7412 9.5199 117.3380 118.8428 3.4804 8.8469 2.3466 0.2264 2.8820 8.5761 1.8829 16.0104 5.6319 16.6095 15.9208 22.5049 10.2679 2.4169 75.2138 41.7474 241.6472 102.2530 50.0738 203.5728 46.0370 39.4588 19.7730 36.3687 31.9970 43.1454 2.9325 2.9006 33.1074 43.1698 11.6699 20.1987 34.1247 21.2770
temp: 298.150 k
press: 1.00000 atm
elementType: 16 7 7 7 6 6 6 6 6 6 6 6 6 6 6 1 1 1 1 1 1 1 1 1 1 1 1 1 1 1 1 1
symmnumber: 1
zpe: 692689.1 jmol-1
zpe.correction: 0.263831 hartree
zpe.thermalcorrener: 0.280653 hartree
zpe.thermalcorrenthalpy: 0.281597 hartree
zpe.thermalcorrgfe: 0.216680 hartree
zpe.sumelectzpe: -990.508407 hartree
zpe.sumelectthermal: -990.491586 hartree
zpe.sumelectthermalent: -990.490642 hartree
zpe.sumelectthermalfe: -990.555559 hartree
dipole: -3.5335 -0.0216 -0.1624
dipole: 3.5373
quadrupole: -73.8549 -92.5599 -96.8993
quadrupole: 6.4882 -2.0735 -2.5798
quadrupole: 13.9164 -4.7885 -9.1279 6.4882 -2.0735 -2.5798
hfenergy: -990.7722389 hartree
pointgroup: C01 [X(C11H17N3S1)]
dipole: 1.3283886 -0.4069143 0.0808017 debye
polarizability: 200.2858177|-13.1166689|152.088687|-6.8577932|9.0774566|127.0868494 unknown
InChI: InChI=1S/C11H17N3S/c1-14(2)8-10(15-11(12)13)9-6-4-3-5-7-9/h3-7,10,12H,8,13H2,1-2H3
charge 0 multiplicity 1
32 atoms
S  1.452346 -1.290333 1.186363
N  0.403896 2.577842 -0.027424
N  3.763502 -2.540812 0.6194
N  2.899866 -1.10713 -1.148622
C  0.54825 0.061037 0.143772
C  1.0002 1.430119 0.694242
C  -0.939264 -0.236103 0.123105
C  -1.415114 -1.292953 -0.698225
C  -1.875501 0.498512 0.89283
C  0.753089 2.616839 -1.46264
C  0.704557 3.853624 0.651937
C  -2.787443 -1.615399 -0.743959
C  -3.251195 0.17618 0.851422
C  -3.713173 -0.881645 0.035886
C  2.864862 -1.654411 0.034569
H  1.01124 -0.123317 -0.845616
H  0.719418 1.517758 1.761757
H  2.11905 1.446426 0.652025
H  -0.695758 -1.868233 -1.294258
H  -1.53558 1.342274 1.499805
H  0.37705 1.715499 -1.97478
H  1.855748 2.6837 -1.643453
H  0.270654 3.493881 -1.929514
H  0.182302 4.680358 0.13783
H  1.797775 4.09898 0.675692
H  0.343357 3.81694 1.695994
H  -3.136098 -2.434287 -1.383688
H  -3.963275 0.755752 1.450292
H  -4.780481 -1.129135 0.003924
H  4.565457 -2.88251 0.093322
H  3.629579 -2.872362 1.573334
H  3.714485 -1.349689 -1.740622
