program: Gaussian 09
title: 000008394
version: EM64L-G09RevD.01
frameworkgroup: C1[X(C8H6N2O)]
method: RPBEPBE
basis: SDD
operation: Freq
keyword: #pfreq=noraman
keyword: PBEPBE/SDD
title: #p freq=noraman PBEPBE/SDD
converged: NO YES NO YES
title: Mulliken charges:
elementType: O N N C C C C C C C C H H H H H H
charge: -0.270521 -0.435602 0.050754 0.157681 0.340082 -0.346845 -0.367344 0.152879 -0.450911 -0.218655 -0.217187 0.279034 0.240291 0.258473 0.239206 0.236742 0.351921
chargesum: 0.00000
title: Mulliken charges with hydrogens summed into heavy atoms:
elementType: O N N C C C C C C C C
charge: -0.270521 -0.083681 0.050754 0.157681 0.340082 -0.067811 -0.127053 0.152879 -0.192438 0.020551 0.019555
polarizability: 1.42054632e+02 -8.81123069e-01 1.17479045e+02 1.43129728e-03 -3.92023985e-03 3.99770168e+01
1716.lowfreq: 0.0002 0.0005 0.0008 6.2873 18.3257 21.4088 124.1678 168.0795 231.1111
frequency: 124.1580 168.0765 231.1081 272.8081 413.5964 453.7078 465.9485 474.1180 528.0924 573.8667 600.7803 663.6456 700.5432 758.1009 776.9909 781.5283 794.4133 867.1893 890.3131 907.1048 982.3261 1010.1059 1020.7848 1056.3482 1097.2336 1127.2611 1174.4088 1236.5013 1247.1392 1282.5768 1344.7911 1392.9497 1401.5502 1447.6590 1470.5158 1535.2501 1577.8594 1616.9946 1629.3179 3130.7916 3143.2689 3156.4532 3158.6055 3171.7459 3535.7820
redmass: 5.8784 4.2623 5.0465 6.6032 3.2753 6.0678 4.5323 8.7818 7.2194 8.4716 3.8827 2.9940 6.5105 1.3238 1.5341 6.2012 2.6612 1.2906 5.0052 1.5529 1.3879 1.3452 2.6904 3.5722 4.6889 1.7667 1.0789 1.9326 2.5395 2.1037 1.8641 1.5919 6.4205 2.1999 2.7965 5.4457 5.6999 6.4714 6.1434 1.0867 1.0901 1.0923 1.0947 1.0999 1.0788
irintensity: 2.4843 0.9931 0.0160 6.3335 3.2143 0.7586 0.3384 4.5357 7.3835 3.3639 8.7725 0.2507 3.0049 109.1651 87.4366 19.0153 8.8775 27.5083 16.1357 4.5103 4.4103 0.2850 8.9140 9.9251 22.6060 30.8576 2.0634 19.2671 5.7060 21.6498 12.1650 3.7483 11.7282 11.5764 9.6644 7.0226 16.0785 54.3969 262.5739 1.1724 10.6510 4.9982 11.4125 18.0272 59.6827
temp: 298.150 k
press: 1.00000 atm
elementType: 8 7 7 6 6 6 6 6 6 6 6 1 1 1 1 1 1
symmnumber: 1
zpe: 331331.6 jmol-1
zpe.correction: 0.126198 hartree
zpe.thermalcorrener: 0.133937 hartree
zpe.thermalcorrenthalpy: 0.134881 hartree
zpe.thermalcorrgfe: 0.093560 hartree
zpe.sumelectzpe: -492.420858 hartree
zpe.sumelectthermal: -492.413119 hartree
zpe.sumelectthermalent: -492.412175 hartree
zpe.sumelectthermalfe: -492.453496 hartree
dipole: 3.2163 -2.2500 0.0002
dipole: 3.9252
quadrupole: -55.1815 -65.4675 -65.9967
quadrupole: 2.2809 0.0001 0.0001
quadrupole: 7.0337 -3.2522 -3.7815 2.2809 0.0001 0.0001
hfenergy: -492.5470554 hartree
pointgroup: C01 [X(C8H6N2O1)]
dipole: 1.2303415 0.9333267 -0.0000713 debye
dipolederiv: -0.5884591 -0.2575319 0.0000137 -0.387676 -1.1824979 0.0000314 0.0000346 0.0000722 -0.3752618 -0.1417832 0.5358007 -0.0000388 -0.5403793 -0.7076489 0.0000235 0.0000277 0.0000034 -0.3046065 -0.1229514 0.09262 0.0000042 0.7263239 0.1459698 -0.0000207 -0.0000505 -0.0000195 -0.1409268 -0.2822374 -0.2818637 0.00002 -0.1952445 -0.125387 0.000009 0.0000141 0.0000085 0.0054339 0.1386533 -0.1030399 0.0000049 0.1009522 -0.0788282 0.0000094 -0.0000109 0.0000137 0.0997993 -0.1162513 0.1786223 -0.0000084 -0.0414663 0.0449127 -0.0000048 0.0000012 -0.0000081 -0.1132386 -0.1930612 0.0968173 -0.0000052 0.0949795 0.1254869 -0.0000136 -0.0000033 -0.0000154 -0.1597141 0.7336161 0.0005126 -0.0000057 0.4593963 1.4612506 -0.0000537 -0.0000342 -0.0000721 0.2511286 -0.0171998 -0.021896 -0.0000026 -0.1651893 0.2028127 -0.0000172 0.0000077 -0.0000263 -0.1034196 0.036293 -0.2128223 0.000009 -0.0750665 -0.0411018 -0.0000053 0.0000023 -0.0000046 -0.1501774 0.1746608 0.0475719 -0.0000057 0.0536139 0.0577779 -0.0000114 -0.0000065 -0.0000116 -0.1343732 0.1075675 -0.0500118 0.0000026 0.0103521 0.0037355 0.0000064 -0.0000014 0.0000046 0.1591443 0.0816171 0.0016839 0.0000007 -0.0477826 -0.0882033 0.0000128 0.0000046 0.000012 0.1605942 0.0641278 -0.0584717 0.0000038 -0.0009523 -0.0475179 0.000012 0.0000042 0.000019 0.1483073 -0.0292591 0.0918261 -0.000002 0.0992323 0.0112048 0.0000066 -0.0000041 0.0000089 0.1614136 -0.0989758 -0.0621911 0.0000061 -0.0633161 0.0775624 0.0000044 0.0000065 0.0000053 0.1583492 0.2536426 0.0023737 0.0000034 -0.0277776 0.1404718 0.0000111 0.0000079 0.00001 0.3375478 unknown
polarizability: 141.9502454|1.8250611|117.5834322|-0.0012791|-0.0039725|39.9770168 unknown
InChI: InChI=1S/C8H6N2O/c11-8-7-4-2-1-3-6(7)5-9-10-8/h1-5,10H
charge 0 multiplicity 1
17 atoms
O  -1.728319 -2.189546 0.000175
N  -2.309018 0.066731 0.000056
N  -2.093815 1.436586 -0.000029
C  0.046439 -0.496498 0.000041
C  0.309978 0.91336 -0.000029
C  1.116913 -1.424506 0.000088
C  1.660193 1.366993 -0.00006
C  -1.353627 -0.978128 0.000068
C  -0.81906 1.826096 -0.00005
C  2.444324 -0.959467 0.000042
C  2.714445 0.437795 -0.000025
H  0.8786 -2.492953 0.000138
H  1.867267 2.443387 -0.000114
H  -0.668664 2.910006 -0.000125
H  3.275184 -1.672996 0.000067
H  3.752024 0.789206 -0.000053
H  -3.295865 -0.205268 0.00011
