program: Gaussian 09
title: 000113658
version: EM64L-G09RevD.01
frameworkgroup: C1[X(C5H13N3S)]
method: RPBEPBE
basis: SDD
operation: Freq
keyword: #p
keyword: freq=noraman
keyword: PBEPBE/SDD
title: #p freq=noraman PBEPBE/SDD
converged: YES YES NO NO
title: Mulliken charges:
elementType: S N N N C C C C C H H H H H H H H H H H H H
charge: 0.079431 -0.311529 -0.587107 -0.015917 -0.614150 -0.336281 -0.159943 -0.601717 -0.659274 0.254666 0.287684 0.220585 0.205021 0.322139 0.269552 0.284310 0.206559 0.238361 0.251192 0.231498 0.224186 0.210735
chargesum: 0.00000
title: Mulliken charges with hydrogens summed into heavy atoms:
elementType: S N N N C C C C C
charge: 0.079431 0.010610 -0.033245 -0.015917 -0.071801 0.089325 -0.159943 0.094395 0.007145
polarizability: 1.27736409e+02 -1.96324173e+00 9.78839833e+01 4.76359338e-01 1.43405202e+00 6.91164896e+01
1716.lowfreq: -24.2301 -7.0251 -0.0037 -0.0033 -0.0030 1.0524 32.3999 36.3297 82.5456
frequency: 30.7308 36.1281 82.5318 109.2890 138.3709 142.9999 162.7841 178.7141 196.2518 226.8077 234.9557 246.2803 334.2152 397.5419 450.4730 477.3745 544.8817 596.7432 682.9661 692.9460 762.6387 926.6584 931.6918 1019.3995 1024.5106 1076.3947 1096.8614 1108.0640 1110.9669 1120.7647 1165.4504 1211.7545 1250.7505 1266.2227 1295.0109 1370.3259 1415.1233 1426.5926 1443.8058 1444.9948 1459.0333 1465.6820 1472.7271 1481.9294 1496.1569 1639.2142 1701.3955 2906.6244 2924.8591 2973.8613 3013.4789 3027.9252 3042.7409 3046.7981 3057.0973 3100.3108 3118.1018 3485.2778 3593.1325 3615.4488
redmass: 2.5579 3.7465 2.2430 1.0624 1.1917 3.2316 1.4487 1.8517 2.5682 3.6257 3.5079 3.5405 4.7274 5.7213 1.1853 3.9100 1.3047 8.0600 4.0890 4.8001 1.1313 5.0946 1.4967 2.2746 2.5159 1.5455 1.3619 2.0817 1.4328 1.2993 2.0111 1.2565 2.5954 1.3529 1.1046 1.3676 1.1865 1.2010 1.1272 1.1477 1.2376 1.0669 1.0519 1.0798 1.0706 1.0953 8.3750 1.0712 1.0379 1.0369 1.0955 1.0641 1.0969 1.0861 1.0965 1.1018 1.1052 1.0450 1.0783 1.0989
irintensity: 0.7421 1.4165 3.4601 0.2910 9.7374 5.8054 19.1022 21.6713 2.7527 6.7494 13.1604 0.6033 34.5356 12.1837 102.8845 3.6360 240.4200 8.4026 48.5268 13.9691 5.5173 125.1328 3.8416 8.1914 4.2068 6.3870 2.3248 38.5827 4.3903 4.6247 41.5340 5.0035 35.5772 2.6077 4.2891 7.9199 25.9725 31.3980 36.1927 50.1940 44.3889 21.6197 12.5635 10.6265 46.8175 37.8711 304.2387 76.3428 83.7200 67.9033 36.9182 13.7237 47.7121 22.6548 37.7222 23.5280 14.0607 0.4343 41.3455 2.9884
temp: 298.150 k
press: 1.00000 atm
elementType: 16 7 7 7 6 6 6 6 6 1 1 1 1 1 1 1 1 1 1 1 1 1
symmnumber: 1
zpe: 484803.2 jmol-1
zpe.correction: 0.184652 hartree
zpe.thermalcorrener: 0.197635 hartree
zpe.thermalcorrenthalpy: 0.198579 hartree
zpe.thermalcorrgfe: 0.144272 hartree
zpe.sumelectzpe: -759.868768 hartree
zpe.sumelectthermal: -759.855785 hartree
zpe.sumelectthermalent: -759.854841 hartree
zpe.sumelectthermalfe: -759.909148 hartree
dipole: -1.3200 -1.0849 0.6269
dipole: 1.8200
quadrupole: -47.3963 -61.1829 -67.3604
quadrupole: -4.1324 1.4914 -4.9454
quadrupole: 11.2503 -2.5364 -8.7139 -4.1324 1.4914 -4.9454
hfenergy: -760.0534201 hartree
pointgroup: C01 [X(C5H13N3S1)]
dipole: 0.5707511 0.4255141 0.0767519 debye
dipolederiv: -0.7975496 -0.1326764 0.1542705 -0.0919382 -0.2851383 0.0639216 0.1918478 0.1300092 -0.1732743 -1.0759516 0.4780948 -0.0006528 0.3388375 -0.7494997 0.0469145 0.0676402 0.0624721 -0.5390004 -0.786005 0.0433948 -0.0088811 0.1462683 -0.2036382 0.0982907 -0.1034687 0.115434 -0.7946392 -0.7625076 -0.2189053 0.2325278 0.0899259 -1.0859062 0.2219314 0.1219885 0.4485469 -0.5247456 0.359252 0.0576218 0.1572643 0.0178848 0.1066161 0.0369941 0.3973505 0.0298296 0.0452199 0.5825493 -0.0341285 0.1999237 -0.1115606 0.1638719 -0.1253698 -0.0545607 -0.0943315 0.4089104 1.479444 -0.0896308 -0.391418 -0.2698166 1.3042114 -0.3679785 -0.5302596 -0.5523605 0.3852336 0.4750168 -0.1029928 -0.0609384 0.0843667 0.1553722 -0.018238 -0.1095427 0.0267337 0.3304478 0.2918586 -0.1360339 -0.0055854 0.001576 0.4929284 -0.0700053 -0.0377715 -0.0182226 0.2195972 -0.0565319 -0.066074 -0.0629269 -0.0450706 -0.0963962 -0.0646471 -0.0692329 -0.0621919 0.0415393 -0.0094082 -0.0117909 0.0242715 -0.0033377 0.0531355 0.0664239 0.0376378 0.03383 -0.0440372 0.0761932 -0.0543503 -0.0466403 -0.0344626 -0.1294744 -0.0488029 -0.0437193 -0.0194312 0.0433143 -0.0313152 -0.002806 0.0135012 -0.0079841 0.0204317 0.1416262 0.0100677 0.0767532 -0.2273092 0.1590387 -0.0470097 0.0814516 -0.0505329 0.1886851 0.0304403 0.0686995 -0.0109677 0.2963875 0.1530393 -0.0625466 -0.1033736 -0.087252 0.0558155 -0.0071547 -0.0666863 0.0460224 0.3034135 0.0307498 0.1035143 -0.0911408 0.0596383 0.1311775 -0.0655612 0.0166623 -0.1076942 0.3020107 -0.0469235 0.1012564 -0.0026515 0.1737558 -0.0552801 0.0582843 -0.0321254 0.0814416 0.0761472 -0.0124992 0.0317993 -0.0270603 -0.0386308 0.0972693 0.0150507 0.1102509 -0.0537301 -0.1738639 0.025046 -0.0176601 -0.0074345 -0.1566818 -0.0340878 -0.0609962 -0.0085039 -0.0705974 0.0499582 -0.0028021 -0.11781 -0.0209072 -0.057745 -0.1749 -0.0199513 0.0032015 -0.060175 0.106883 0.0085448 0.1359029 -0.1246298 0.0372506 0.0307188 0.0056533 -0.1198749 0.0506346 -0.0923863 -0.0592384 0.1428309 0.0910301 0.005509 0.0140873 0.063174 0.1503991 -0.0520053 -0.0398065 unknown
polarizability: 126.8533008|-5.8098483|94.1040883|-0.9783091|-10.6548859|73.7794924 unknown
InChI: InChI=1S/C5H13N3S/c1-7-5(8-2)9-4-3-6/h7H,3-4,6H2,1-2H3
charge 0 multiplicity 1
22 atoms
S  0.326633 0.908024 -1.221445
N  -2.171618 1.339378 -0.231968
N  3.931809 -0.052074 0.646576
N  -1.377642 -0.78008 0.406516
C  1.678602 0.784395 0.121667
C  2.892059 -0.007419 -0.397573
C  -1.202188 0.352313 -0.195178
C  -3.497877 1.135779 0.359709
C  -0.449645 -1.906747 0.316645
H  1.959041 1.816542 0.393484
H  1.244215 0.289954 1.003833
H  2.573138 -1.041813 -0.619565
H  3.234646 0.435132 -1.362255
H  -1.889229 2.259565 -0.565281
H  4.432611 0.826462 0.801004
H  4.551792 -0.863873 0.618256
H  -4.161519 1.962513 0.054048
H  -3.452605 1.091472 1.465237
H  -3.920435 0.178022 0.009658
H  -1.024201 -2.835277 0.142445
H  0.093812 -2.037427 1.273884
H  0.298201 -1.797538 -0.498795
