program: Gaussian 09
title: 000113651
version: EM64L-G09RevD.01
frameworkgroup: C1[X(C11H17N3S)]
method: RPBEPBE
basis: SDD
operation: Freq
keyword: #p
keyword: freq=noraman
keyword: PBEPBE/SDD
title: #p freq=noraman PBEPBE/SDD
converged: YES YES NO NO
title: Mulliken charges:
elementType: S N N N C C C C C C C C C C C H H H H H H H H H H H H H H H H H
charge: 0.162945 -0.573346 -0.052438 -0.568755 -0.330601 -0.339439 -0.691521 -0.387743 -0.198217 0.292132 -0.334956 -0.379542 -0.221727 -0.203233 -0.257593 0.207706 0.220109 0.218905 0.178948 0.237020 0.281816 0.209901 0.180293 0.277132 0.259441 0.239065 0.244050 0.220792 0.222278 0.223715 0.328280 0.334582
chargesum: 0.00000
title: Mulliken charges with hydrogens summed into heavy atoms:
elementType: S N N N C C C C C C C C C C C
charge: 0.162945 -0.036773 -0.052438 0.094107 0.097214 0.058414 -0.172685 0.002451 -0.198217 0.292132 -0.095891 -0.135492 -0.000935 0.019045 -0.033877
polarizability: 2.39097411e+02 -3.56334306e+01 1.55907254e+02 1.86209286e+01 1.18494642e+01 1.19980288e+02
1716.lowfreq: -5.9775 -5.9366 0.0017 0.0021 0.0026 12.7610 14.9975 36.1441 42.1079
frequency: 11.0008 36.1256 42.0749 52.8999 76.2329 87.1523 110.9071 120.2606 141.9837 166.4835 188.9714 224.9569 264.8262 320.7902 348.4952 363.2322 366.3379 410.5521 445.5143 458.0823 480.0413 509.1869 541.6429 593.5585 594.8800 613.5561 616.9945 688.7274 696.8132 753.3562 763.4045 784.3890 793.0161 835.1666 893.2029 902.6041 963.4757 964.4156 982.6134 984.0953 1018.6959 1020.0003 1049.0346 1057.9847 1068.9135 1078.7256 1093.2314 1114.6064 1167.2920 1181.6715 1206.6699 1218.8469 1237.5262 1260.9948 1288.2241 1293.2820 1299.2882 1307.1440 1310.9938 1348.9130 1372.2970 1387.1228 1438.1898 1450.6569 1466.2254 1477.5943 1478.3721 1492.4788 1576.7595 1592.6368 1606.6208 1639.7083 1677.8291 2866.7287 2964.5081 2983.3404 3000.9468 3015.6297 3030.9286 3054.8797 3093.6975 3121.0478 3128.5480 3143.0398 3154.0991 3166.4838 3459.7950 3536.3063 3587.7769 3697.4757
redmass: 5.7696 3.9353 4.8993 1.8188 4.4058 4.6453 2.8495 2.7033 2.4696 3.9535 4.0213 1.3323 3.5021 3.2807 4.1612 2.8302 1.4435 2.9261 4.1703 2.6764 1.9783 2.7995 3.9815 1.3238 3.8731 5.2464 6.5239 4.6454 2.0921 1.0712 1.8441 3.9170 1.1526 1.2424 1.2519 1.4555 1.3872 1.9471 1.4501 4.0798 3.3702 2.4244 1.7258 2.0862 1.8983 1.5495 2.1152 2.0110 1.0563 1.1097 1.3906 2.1918 1.3438 1.3032 1.0488 2.1885 1.3113 1.3601 1.4928 1.4593 5.6708 1.4333 2.4629 1.0871 1.0688 1.1071 2.2863 1.0904 6.0262 1.1938 6.0077 1.0944 9.2896 1.0716 1.0638 1.0605 1.0602 1.0853 1.0972 1.1023 1.1063 1.0842 1.0879 1.0933 1.0959 1.1009 1.0449 1.0452 1.0977 1.1034
irintensity: 0.1770 0.2694 0.2244 2.3139 2.5148 1.2443 6.9898 0.3642 0.4947 1.3716 5.3015 46.7357 14.0242 8.9874 1.9332 26.8749 127.0377 0.6873 11.8035 6.0821 114.7631 9.1390 53.9728 202.0386 57.3204 48.7438 3.9296 1.2343 49.7512 11.3783 54.1919 55.8106 0.2791 0.8047 0.4115 10.0360 0.2100 0.4730 0.6801 1.4958 0.6799 14.0869 3.1730 13.2043 1.1238 14.5629 2.8970 40.7019 0.4755 3.5822 7.6862 152.5246 9.8720 3.8863 4.0448 23.0280 5.1279 12.3608 7.9828 5.1702 2.1756 24.5624 1.4797 6.6877 1.2576 2.1320 43.7602 5.9674 12.8120 82.6173 138.0818 40.9678 878.9815 108.1240 24.4075 14.4761 34.4152 30.8138 4.8980 59.6524 33.0688 6.4913 6.5554 32.3744 32.5109 18.0476 1.2087 64.3916 0.4695 28.3396
temp: 298.150 k
press: 1.00000 atm
elementType: 16 7 7 7 6 6 6 6 6 6 6 6 6 6 6 1 1 1 1 1 1 1 1 1 1 1 1 1 1 1 1 1
symmnumber: 1
zpe: 696679.9 jmol-1
zpe.correction: 0.265351 hartree
zpe.thermalcorrener: 0.282370 hartree
zpe.thermalcorrenthalpy: 0.283314 hartree
zpe.thermalcorrgfe: 0.217532 hartree
zpe.sumelectzpe: -990.525820 hartree
zpe.sumelectthermal: -990.508801 hartree
zpe.sumelectthermalent: -990.507857 hartree
zpe.sumelectthermalfe: -990.573639 hartree
dipole: -4.3253 1.0327 -0.8506
dipole: 4.5275
quadrupole: -89.7010 -85.6708 -98.7178
quadrupole: -1.8846 9.1232 0.5422
quadrupole: 1.6622 5.6924 -7.3546 -1.8846 9.1232 0.5422
hfenergy: -990.791171 hartree
pointgroup: C01 [X(C11H17N3S1)]
dipole: 1.6379475 -0.6356731 -0.29321 debye
polarizability: 230.074609|-48.1647061|153.5858542|-14.650817|-16.5175803|131.3244888 unknown
InChI: InChI=1S/C11H17N3S/c12-8-4-5-9-15-11(13)14-10-6-2-1-3-7-10/h1-3,6-7H,4-5,8-9,12-13H2
charge 0 multiplicity 1
32 atoms
S  0.383239 -0.518536 -0.734369
N  6.935437 0.503298 -0.090514
N  -1.937882 -1.144638 0.79064
N  -0.190391 -2.679322 0.893678
C  3.115256 0.105641 -0.53604
C  4.561395 -0.226871 -0.097456
C  2.122155 -0.981749 -0.090955
C  5.568186 0.868623 -0.509488
C  -0.748772 -1.502779 0.415327
C  -2.673462 -0.005529 0.406045
C  -2.719847 0.487496 -0.930757
C  -3.466466 0.635122 1.399996
C  -3.516146 1.608876 -1.248429
C  -4.252554 1.758732 1.075325
C  -4.281089 2.256001 -0.250474
H  3.078458 0.21786 -1.638275
H  2.805654 1.077085 -0.104422
H  4.617629 -0.352703 1.00068
H  4.872268 -1.194027 -0.547082
H  2.412005 -1.962776 -0.510389
H  2.066355 -1.047568 1.008325
H  5.297067 1.813387 -0.000244
H  5.463107 1.055228 -1.607528
H  7.610058 1.273285 -0.111829
H  7.300187 -0.33895 -0.546577
H  -2.15687 -0.024299 -1.719643
H  -3.444771 0.234205 2.418542
H  -3.542948 1.973911 -2.281709
H  -4.848799 2.245155 1.856007
H  -4.897782 3.125618 -0.502715
H  -0.751327 -3.232447 1.54065
H  0.647447 -3.077932 0.481481
