program: Gaussian 09
title: 000113645
version: EM64L-G09RevD.01
frameworkgroup: C1[X(C12H25NOS)]
method: RPBEPBE
basis: SDD
operation: Freq
keyword: #p
keyword: freq=noraman
keyword: PBEPBE/SDD
title: #p freq=noraman PBEPBE/SDD
converged: YES YES NO NO
title: Mulliken charges:
elementType: S O N C C C C C C C C C C C C H H H H H H H H H H H H H H H H H H H H H H H H H
charge: 0.740263 -0.529357 -0.336974 0.330175 -0.404891 -0.411170 -0.378866 -0.387884 -0.732674 -0.733284 -0.724264 -0.381434 -0.369603 -0.351867 -0.481767 0.191239 0.191221 0.204683 0.204625 0.193558 0.193170 0.195031 0.194505 0.199863 0.198280 0.208001 0.214678 0.208699 0.215451 0.207953 0.208378 0.209258 0.209389 0.209112 0.196565 0.194193 0.212321 0.230190 0.213509 0.249726
chargesum: 0.00000
title: Mulliken charges with hydrogens summed into heavy atoms:
elementType: S O N C C C C C C C C C C C C
charge: 0.740263 -0.529357 -0.336974 0.330175 -0.022431 -0.001863 0.007862 0.001653 -0.101296 -0.101502 -0.096505 0.016709 0.021155 0.090643 -0.018533
polarizability: 2.48943227e+02 1.78789733e+01 1.33740789e+02 -6.98834785e+00 4.52298105e-02 1.30990437e+02
1716.lowfreq: -22.5272 -8.2307 -3.4366 -0.0024 -0.0023 -0.0019 12.0662 16.1859 27.0434
frequency: 8.0613 14.6788 24.7938 41.1771 48.7325 66.1487 86.5000 98.1208 110.7653 133.7545 135.4580 141.8134 155.4744 202.4893 215.7067 235.8618 244.9929 258.9451 290.0532 303.5904 318.8716 360.6071 399.7470 401.0232 425.1911 465.2734 491.8777 509.8124 702.7402 721.5659 731.5796 735.9470 751.7905 789.1973 849.1596 893.0454 903.2725 917.6637 925.1882 928.0727 937.9662 972.0186 982.9409 984.4650 998.2558 1016.2490 1019.7969 1036.8030 1056.2537 1074.3064 1078.3100 1086.6109 1088.1939 1141.8228 1191.1636 1200.4139 1220.1260 1229.8699 1249.0343 1254.3953 1260.5644 1274.5550 1279.6842 1286.5808 1290.9863 1294.6998 1310.7738 1318.4323 1332.6884 1345.4789 1351.1002 1353.1302 1372.5371 1373.7909 1399.2403 1447.5814 1450.6828 1459.4093 1459.7766 1462.0399 1465.0705 1465.6473 1466.1047 1471.6903 1480.4046 1483.1831 1485.9601 1486.8101 1495.3324 2926.7207 2942.5043 2950.3754 2953.3640 2956.6692 2961.4283 2964.3790 2965.0531 2968.9630 2971.7249 2985.7126 2990.6946 2991.5906 2997.5031 3009.4109 3011.5963 3030.5145 3042.8440 3056.6142 3057.5786 3060.5651 3063.5622 3065.7296 3066.7572 3071.0157
redmass: 3.0245 4.8999 3.4939 3.6033 2.7711 2.9997 3.3461 2.1459 2.6302 3.3004 2.3803 2.2341 4.3085 1.1144 3.7619 4.0125 1.0582 1.0711 3.4748 3.3443 2.0929 2.6907 3.3922 2.0776 2.9580 3.1622 3.3658 2.9786 6.8403 1.0680 1.0942 3.5225 1.1307 1.2120 1.2861 18.6826 2.2639 1.4548 1.6129 1.4945 1.2033 6.0584 1.4211 4.0080 2.6363 2.4059 1.2715 2.6274 3.0185 2.5926 2.2153 3.3303 1.3442 1.4357 1.5103 1.6769 1.6146 1.6439 1.6313 1.4728 2.0783 1.1818 1.1063 1.2088 1.1536 1.1512 1.3128 1.2982 1.3265 1.4924 1.6096 1.5857 1.2122 1.2125 1.2123 1.0795 1.0740 1.0508 1.0703 1.0697 1.0728 1.0501 1.0495 1.0940 1.0985 1.0609 1.0586 1.0994 1.0621 1.0615 1.0583 1.0585 1.0587 1.0589 1.0353 1.0586 1.0351 1.0543 1.0403 1.0965 1.0891 1.0735 1.0987 1.0944 1.1034 1.1051 1.1048 1.1001 1.0998 1.0996 1.1047 1.0984 1.0987 1.0981
irintensity: 2.0868 1.2462 1.7979 0.6163 2.5583 1.0482 3.4176 5.1471 1.5253 0.7908 1.7437 0.4103 0.8055 0.0002 0.6293 1.5956 0.0355 0.0383 0.6032 2.4870 0.0282 1.9803 3.6363 0.2066 1.2462 3.9257 2.8276 4.6838 6.1929 12.5330 1.1334 0.5102 4.4612 0.1775 0.6671 71.5481 3.9519 0.2701 1.8363 1.2320 0.0055 2.2430 0.9814 3.7970 0.6992 0.3910 0.0500 1.6383 0.4297 0.7508 0.5845 6.5161 0.9944 0.7521 15.7426 1.1243 25.6670 0.9503 9.4547 5.0247 8.1144 3.9238 0.0491 1.8919 0.3838 0.3930 3.9006 3.5488 2.9408 0.4919 1.0819 0.3214 22.2070 24.5621 12.6328 12.3268 0.2855 0.1295 0.1528 1.4627 0.8108 0.5962 0.5677 1.6259 0.6770 9.1307 14.9253 18.8970 30.6079 39.6614 22.9201 2.6817 7.1075 0.3661 37.3936 25.9746 44.2473 108.0659 46.2159 0.4121 15.4512 24.3880 2.0698 10.0381 0.4993 0.6255 137.4737 0.0917 1.4604 55.1767 86.5539 101.2015 38.8859 94.0734
temp: 298.150 k
press: 1.00000 atm
elementType: 16 8 7 6 6 6 6 6 6 6 6 6 6 6 6 1 1 1 1 1 1 1 1 1 1 1 1 1 1 1 1 1 1 1 1 1 1 1 1 1
symmnumber: 1
zpe: 917204.1 jmol-1
zpe.correction: 0.349345 hartree
zpe.thermalcorrener: 0.369705 hartree
zpe.thermalcorrenthalpy: 0.370650 hartree
zpe.thermalcorrgfe: 0.295455 hartree
zpe.sumelectzpe: -998.962399 hartree
zpe.sumelectthermal: -998.942038 hartree
zpe.sumelectthermalent: -998.941094 hartree
zpe.sumelectthermalfe: -999.016289 hartree
dipole: 4.5691 2.0162 2.1321
dipole: 5.4302
quadrupole: -154.5884 -103.0158 -103.4046
quadrupole: -14.5569 -14.8705 -1.2738
quadrupole: -34.2522 17.3205 16.9317 -14.5569 -14.8705 -1.2738
hfenergy: -999.3117439 hartree
pointgroup: C01 [X(C12H25N1O1S1)]
dipole: -1.7967633 1.0662051 -0.4462644 debye
polarizability: 247.4208362|-16.1463661|133.9352287|-16.7955476|1.6362125|132.318388 unknown
InChI: InChI=1S/C12H25NOS/c1-12(2,3)10-8-6-4-5-7-9-11-13-15-14/h4-11H2,1-3H3
charge 0 multiplicity 1
40 atoms
S  7.097777 -0.081151 -0.933948
O  8.34526 -1.078495 -0.602272
N  5.988344 -0.146973 0.355974
C  -5.584871 -0.01444 -0.0112
C  -4.17284 -0.682777 -0.029691
C  -2.950869 0.263427 0.010567
C  -1.611072 -0.508746 0.006399
C  -0.371863 0.413645 0.043442
C  -5.789914 0.80532 1.29095
C  -5.774511 0.910058 -1.243307
C  -6.649602 -1.14406 -0.064448
C  0.962894 -0.36557 0.05236
C  2.204257 0.554376 0.09453
C  3.527269 -0.244294 0.115848
C  4.768711 0.685046 0.14941
H  -4.100641 -1.313648 -0.941582
H  -4.108715 -1.378954 0.833949
H  -2.973384 0.949417 -0.860052
H  -2.9940 0.901023 0.916473
H  -1.582627 -1.195549 0.878303
H  -1.562307 -1.152903 -0.896691
H  -0.424321 1.061913 0.943121
H  -0.395136 1.094812 -0.832869
H  0.982529 -1.046899 0.92801
H  1.014861 -1.01326 -0.847415
H  -6.819937 1.207002 1.339085
H  -5.094917 1.662861 1.350642
H  -5.630482 0.17338 2.185782
H  -5.076564 1.766964 -1.223838
H  -6.802983 1.317748 -1.268631
H  -5.607159 0.353895 -2.18569
H  -7.673368 -0.724202 -0.052617
H  -6.551702 -1.824946 0.802699
H  -6.540891 -1.748743 -0.985098
H  2.149682 1.201389 0.994438
H  2.186919 1.233368 -0.783488
H  3.591275 -0.901595 -0.77326
H  3.557494 -0.901726 1.005204
H  4.785714 1.330064 -0.757853
H  4.696593 1.342223 1.039265
