program: Gaussian 09
title: 000113625
version: EM64L-G09RevD.01
frameworkgroup: C1[X(C14H19N7O4S)]
method: RPBEPBE
basis: SDD
operation: Freq
keyword: #p
keyword: freq=noraman
keyword: PBEPBE/SDD
title: #p freq=noraman PBEPBE/SDD
converged: YES YES NO NO
title: Mulliken charges:
elementType: S O O O O N N N N N N N C C C C C C C C C C C C C C H H H H H H H H H H H H H H H H H H H
charge: 1.032351 -0.502186 -0.534698 -0.296072 -0.287898 -0.448390 -0.647606 -0.157778 -0.068534 -0.151881 -0.035475 -0.021909 0.258477 0.282148 -0.260558 -0.301476 0.105694 0.173470 -0.338084 -0.279917 0.177618 -0.352316 -0.509567 -0.501280 -0.597711 -0.614719 0.326746 0.352888 0.266371 0.241270 0.251559 0.263551 0.247473 0.235537 0.266016 0.218127 0.241157 0.227843 0.246244 0.238484 0.237892 0.262803 0.267549 0.222608 0.264179
chargesum: 0.00000
title: Mulliken charges with hydrogens summed into heavy atoms:
elementType: S O O O O N N N N N N N C C C C C C C C C C C C C C
charge: 1.032351 -0.502186 -0.534698 -0.296072 -0.287898 -0.121644 -0.294718 -0.157778 -0.068534 -0.151881 -0.035475 -0.021909 0.258477 0.282148 0.005812 -0.060206 0.105694 0.173470 -0.086525 -0.016366 0.177618 -0.104843 0.210114 0.213964 0.141468 0.139617
polarizability: 5.82615496e+02 6.94430664e+01 3.00478728e+02 -1.23722179e+01 8.57978342e+00 1.99376081e+02
1716.lowfreq: -3.8711 -3.6663 -0.0014 -0.0013 0.0010 5.3999 7.3812 19.8919 24.2187
frequency: 7.0274 19.6980 24.1904 34.0709 36.4937 49.1293 54.7843 68.4351 76.2768 86.2788 94.4331 98.1522 108.2993 113.7921 126.7094 136.8186 139.7080 153.2510 156.3828 169.8263 194.3598 204.4004 228.0775 240.2038 244.3025 265.5249 286.6666 319.1409 324.9156 343.7457 375.0967 387.3050 390.4450 404.2772 409.8012 429.9929 439.5666 468.5985 512.5072 529.1852 542.5390 556.5940 560.2713 594.8999 598.8315 629.3943 630.8809 679.3633 696.6850 753.0810 758.1264 789.0463 822.8246 826.1095 827.5851 832.7736 865.0727 893.4701 907.3246 922.8300 941.4824 947.3554 979.0744 983.6012 989.3347 1034.3242 1036.7686 1055.7849 1065.5048 1080.6604 1109.0324 1111.6251 1113.9253 1116.5633 1127.4689 1141.3503 1155.8222 1162.8752 1209.9533 1229.2089 1250.1186 1263.9792 1269.1465 1277.0596 1297.2369 1310.5131 1318.7021 1331.4574 1337.4877 1393.3720 1398.4939 1417.7204 1425.7594 1432.1229 1439.5658 1440.5110 1448.1197 1451.7532 1453.9314 1461.6562 1464.8484 1468.2575 1474.8744 1477.0805 1480.0991 1488.4011 1497.3832 1535.4046 1539.1081 1599.5358 2975.3770 2985.9069 2991.5207 3006.9444 3052.9358 3068.0695 3072.2283 3097.8992 3112.4487 3122.9856 3127.5087 3134.0025 3138.8444 3142.6154 3156.9894 3166.9986 3169.5685 3181.0814 3502.8260
redmass: 5.4106 4.3171 3.4718 4.7924 6.4588 3.6499 2.5788 5.7251 5.1948 4.5322 3.3922 1.9003 1.7609 2.9856 2.5435 1.3318 3.3600 2.4809 2.3007 4.0141 3.7035 3.2586 6.1735 4.6499 4.1670 4.8115 4.9256 4.1652 6.1159 6.6045 5.7641 8.2883 6.2449 4.1575 3.6787 3.6943 4.4871 4.3096 3.8806 5.9456 3.6878 3.5124 3.7140 2.2766 5.0473 10.9709 6.6907 3.2787 6.1318 4.1907 10.1787 4.9571 3.5660 1.5786 6.2349 10.0899 1.7648 5.1904 6.7432 1.4198 10.5742 15.2771 1.3546 1.3850 2.5842 2.8888 1.6148 1.5000 2.0122 1.2460 1.5898 1.2491 1.2451 1.9418 1.3555 1.4118 1.3128 1.7559 3.0018 2.3055 1.4576 2.7406 2.8327 3.7539 3.7706 2.5723 2.5918 4.2263 3.0298 1.5727 2.5139 1.1530 1.4259 1.5698 1.2017 1.0619 1.0529 1.2748 3.7608 2.1457 1.0667 1.0458 1.7538 1.0576 1.2838 1.1808 5.6915 7.8639 5.5341 6.0912 1.0356 1.0336 1.0336 1.0286 1.1018 1.0793 1.0996 1.0986 1.1048 1.1012 1.0988 1.0893 1.1055 1.1055 1.0886 1.0923 1.0948 1.0976 1.0770
irintensity: 0.6893 0.2997 0.3940 0.1888 1.6903 4.0673 4.8078 5.6386 0.9454 1.4345 1.2283 7.2521 7.8047 101.5223 18.9323 0.3815 4.2700 5.3103 9.2385 4.4345 15.7647 21.6864 1.0451 11.1423 30.3910 7.6580 36.7879 4.5099 21.9118 28.0954 12.6954 36.2016 0.2271 28.3253 21.5738 19.6984 1.8559 122.7979 23.0729 2.5603 19.1601 18.3744 18.2146 233.3724 9.6761 31.5170 6.2278 96.0129 63.0634 0.8759 4.6538 5.3611 35.5831 30.1125 26.9915 95.2090 49.8236 28.1722 7.7168 11.9113 43.5951 65.1602 2.0575 1.4611 1.1410 378.2760 18.5208 42.2183 173.8008 0.9788 38.2638 1.3705 10.1384 64.8573 2.5134 10.5858 115.3227 41.8585 38.8436 171.3254 31.3858 122.6673 126.6660 52.3485 198.6537 320.2796 322.8962 18.9713 244.0807 99.6911 16.7642 35.4289 41.2744 69.9004 11.5217 18.4141 12.7361 18.5931 17.5360 67.2261 83.9261 13.5566 59.2720 30.2112 9.6250 66.1274 28.6114 897.5306 12.6971 187.0778 100.4040 63.9244 81.7573 64.1824 27.5807 198.0085 13.8754 33.9114 23.9460 10.2026 14.7235 5.0977 10.3723 23.7573 5.3879 10.3060 4.3573 3.5710 72.1805
temp: 298.150 k
press: 1.00000 atm
elementType: 16 8 8 8 8 7 7 7 7 7 7 7 6 6 6 6 6 6 6 6 6 6 6 6 6 6 1 1 1 1 1 1 1 1 1 1 1 1 1 1 1 1 1 1 1
symmnumber: 1
zpe: 877351.6 jmol-1
zpe.correction: 0.334166 hartree
zpe.thermalcorrener: 0.362717 hartree
zpe.thermalcorrenthalpy: 0.363661 hartree
zpe.thermalcorrgfe: 0.269814 hartree
zpe.sumelectzpe: -1624.901363 hartree
zpe.sumelectthermal: -1624.872812 hartree
zpe.sumelectthermalent: -1624.871868 hartree
zpe.sumelectthermalfe: -1624.965715 hartree
dipole: -6.1049 -10.7293 0.9571
dipole: 12.3816
quadrupole: -94.3021 -164.2433 -157.4625
quadrupole: -3.2308 -1.0120 -4.5651
quadrupole: 44.3672 -25.5740 -18.7932 -3.2308 -1.0120 -4.5651
hfenergy: -1625.235529 hartree
pointgroup: C01 [X(C14H19N7O4S1)]
dipole: -2.738651 -4.0260592 0.1421606 debye
polarizability: 589.7233088|46.4682532|291.9363951|28.1217651|13.2580125|200.8106008 unknown
InChI: InChI=1S/C8H11N4.C6H8N3O4S/c1-12(2)11-10-8-5-3-7(9)4-6-8;1-12-4-5(9-14(10)11)7-3-8-6(4)13-2/h3-6,9H,1-2H3;3,9H,1-2H3
charge 0 multiplicity 1
45 atoms
S  1.250152 2.58495 0.386754
O  2.555367 3.476868 0.042829
O  0.232025 3.101177 1.539661
O  3.508269 -0.874623 2.348902
O  4.995555 -2.745926 0.628581
N  0.205145 2.041233 -1.397142
N  1.836327 0.889479 1.111679
N  2.409849 0.065622 -1.037934
N  3.97197 -1.770237 -1.275007
N  -5.066223 0.219281 -0.466413
N  -6.605011 -1.398056 -0.403862
N  -5.316742 -1.071454 -0.656879
C  -1.058391 1.522003 -1.12328
C  2.554401 0.010881 0.335122
C  -2.11295 2.430756 -0.779059
C  -1.359449 0.116836 -1.211386
C  3.408324 -0.960451 0.956063
C  -3.712207 0.568449 -0.697305
C  -3.410324 1.958206 -0.564003
C  -2.662635 -0.349442 -1.031003
C  4.114439 -1.82428 0.082369
C  3.128637 -0.8272 -1.766317
C  3.589534 -2.12545 3.137493
C  5.764334 -3.575496 -0.329108
C  -6.972254 -2.800552 -0.622495
C  -7.600266 -0.405593 0.041741
H  0.915846 1.297175 -1.642017
H  1.990557 0.886006 2.127818
H  -1.874478 3.494752 -0.693256
H  -0.546073 -0.580192 -1.447083
H  -4.225363 2.637967 -0.297126
H  -2.89856 -1.41324 -1.124395
H  3.021298 -0.77724 -2.853428
H  3.6220 -1.790429 4.184781
H  4.495481 -2.692961 2.875054
H  2.68979 -2.745043 2.963248
H  5.085192 -4.190233 -0.94227
H  6.402427 -4.201443 0.311667
H  6.368787 -2.935592 -0.992515
H  -7.751301 -2.888002 -1.403002
H  -7.354417 -3.257115 0.309504
H  -6.071178 -3.340765 -0.948631
H  -7.258847 0.088014 0.968797
H  -8.556905 -0.922649 0.21399
H  -7.725928 0.385008 -0.720234
