program: Gaussian 09
title: 000008389
version: EM64L-G09RevD.01
frameworkgroup: C1[X(C9H13NO)]
method: RPBEPBE
basis: SDD
operation: Freq
keyword: #p
keyword: freq=noraman
keyword: PBEPBE/SDD
title: #p freq=noraman PBEPBE/SDD
converged: YES YES NO NO
title: Mulliken charges:
elementType: O N C C C C C C C C C H H H H H H H H H H H H H
charge: -0.445249 -0.193971 0.311111 0.316915 -0.477283 -0.348376 0.293152 -0.832848 -0.652570 -0.641502 -0.430202 0.260204 0.224695 0.217099 0.225454 0.248453 0.247868 0.224704 0.200629 0.253632 0.209785 0.220731 0.216981 0.350586
chargesum: 0.00000
title: Mulliken charges with hydrogens summed into heavy atoms:
elementType: O N C C C C C C C C C
charge: -0.094663 -0.193971 0.311111 0.316915 -0.217079 -0.123681 0.293152 -0.141842 0.020631 0.042647 -0.213221
polarizability: 1.47745360e+02 2.83423081e+00 1.19559947e+02 1.00812081e+00 -1.19303822e+00 6.22758412e+01
1716.lowfreq: -14.2896 -0.0006 -0.0006 -0.0004 1.1346 8.0070 83.3574 113.8351 135.9926
frequency: 83.3572 113.8336 135.9843 162.2835 214.3039 225.9696 270.1799 293.2781 299.7794 341.2449 344.1459 351.0475 378.8134 446.4061 468.1531 503.7844 542.8657 621.0444 692.6772 720.4044 746.8572 776.0607 859.4512 876.8190 914.1597 972.2610 996.8333 1041.7260 1049.8010 1090.0228 1098.6779 1133.0051 1148.4925 1158.5073 1191.6328 1211.7509 1237.1668 1281.9635 1331.8764 1376.9860 1393.0487 1422.9326 1427.3488 1454.8933 1463.7008 1470.9934 1472.1782 1477.1442 1492.3895 1500.8179 1508.0183 1581.4755 1629.2956 2890.8601 2905.1592 2960.5086 3022.5041 3023.5636 3040.8055 3081.0370 3092.1043 3111.8279 3123.9496 3135.8190 3172.8154 3584.3827
redmass: 2.8926 2.8053 1.5808 2.3248 2.0449 1.0445 1.2309 3.1933 2.9626 1.9097 1.6012 2.6706 3.3637 4.4191 3.1226 3.7509 3.4475 3.7311 5.9728 3.2791 4.2492 1.3902 1.5984 5.2289 1.3176 2.0974 1.7739 1.4811 1.4757 1.2440 1.9900 1.4297 1.3176 1.4651 1.8818 3.7066 2.9853 1.4741 3.0789 5.5088 1.2855 1.2274 1.5371 1.2750 1.1829 1.0696 1.0883 1.1162 1.1298 1.5834 1.5502 6.8874 6.2546 1.0537 1.0545 1.0411 1.0824 1.0784 1.0912 1.0998 1.0996 1.0868 1.0942 1.0969 1.0908 1.0659
irintensity: 3.3574 2.2221 1.8050 5.5132 4.2245 0.5724 4.9380 2.8870 1.6861 34.5025 94.6847 14.5968 6.6758 4.8008 6.6482 6.8191 1.2473 10.6237 0.3556 2.4695 9.2684 42.9644 31.7270 30.3341 0.7402 57.0722 39.9565 2.6018 15.4554 5.6964 120.1913 20.5705 47.6871 95.0129 3.8474 20.5061 5.2926 5.7081 35.5645 17.6745 23.2279 8.5502 27.3859 15.6769 26.9248 2.2065 36.9664 34.5409 11.7748 18.3434 76.7283 65.4764 124.5382 83.0707 165.0650 52.8476 60.8698 30.8802 28.4255 16.4115 25.4734 15.8638 16.1380 23.5420 3.5117 30.8473
temp: 298.150 k
press: 1.00000 atm
elementType: 8 7 6 6 6 6 6 6 6 6 6 1 1 1 1 1 1 1 1 1 1 1 1 1
symmnumber: 1
zpe: 527213.3 jmol-1
zpe.correction: 0.200805 hartree
zpe.thermalcorrener: 0.212256 hartree
zpe.thermalcorrenthalpy: 0.213200 hartree
zpe.thermalcorrgfe: 0.164558 hartree
zpe.sumelectzpe: -479.874912 hartree
zpe.sumelectthermal: -479.863461 hartree
zpe.sumelectthermalent: -479.862517 hartree
zpe.sumelectthermalfe: -479.911159 hartree
dipole: -0.5811 0.7161 0.4569
dipole: 1.0292
quadrupole: -53.3489 -64.7421 -70.0682
quadrupole: 5.2052 -0.7374 0.6350
quadrupole: 9.3708 -2.0224 -7.3484 5.2052 -0.7374 0.6350
hfenergy: -480.0757172 hartree
pointgroup: C01 [X(C9H13N1O1)]
dipole: 0.2149639 -0.2664062 0.2162798 debye
dipolederiv: -0.9352073 0.6274752 -0.0569558 0.77131 -0.6637383 -0.0019837 -0.0497448 0.01035 -0.4242296 -1.196335 -0.3276619 -0.0438307 -0.0655595 -0.5166516 -0.0301398 0.1463411 0.069988 -0.4295056 1.1830116 0.3709338 -0.0455417 0.4280493 0.3229631 0.0695201 -0.0765577 0.0343415 -0.0191265 -0.2138151 -0.2028499 -0.0071526 -0.4313184 -0.1029008 0.0083482 0.1302891 0.0356555 -0.1093039 -0.5955248 0.0523599 -0.0146514 0.1166923 -0.0537143 -0.0331884 -0.1196282 -0.0447167 -0.2120626 0.3318287 0.0874795 -0.0097038 -0.0613645 0.1100231 -0.0166116 0.0001404 -0.0289817 -0.1377243 1.0239828 -0.4616145 0.0224126 -0.658959 0.7004679 -0.0362722 -0.0027797 -0.072815 0.07648 -0.0174593 0.0284854 0.0382367 0.0516327 -0.0179097 -0.0022417 0.0338445 0.0339753 0.0979919 0.1001567 0.016991 -0.0930513 0.2274113 0.5645359 -0.0041889 -0.1377772 -0.0302538 0.2291942 0.5139778 0.0069733 0.1699355 -0.2519492 0.0633045 0.102107 0.1940721 0.1357051 0.4008221 -0.2591215 -0.0182013 0.0036317 0.3525286 -0.358867 -0.002474 -0.0088052 0.0134048 -0.2473228 0.1038429 -0.0348406 0.0035965 -0.027758 -0.0605389 0.0189196 0.0041826 0.007441 0.1662255 0.0780569 -0.0236877 0.0081784 -0.048745 -0.1333884 0.0166129 -0.010178 0.0088784 0.141032 -0.0033323 0.1055416 -0.0815314 0.0767473 0.0483402 0.0223118 -0.1346402 0.0761916 -0.1090092 0.0391551 -0.1154299 -0.0542873 -0.0125066 -0.1136443 -0.0780476 -0.0181879 -0.0966725 0.0688726 -0.0516274 0.0178168 0.0816535 -0.0550356 0.0979574 0.0616628 0.0987301 0.0084748 0.0333769 0.0597633 0.0587646 -0.1442725 -0.0011628 0.0506559 0.0167462 -0.0866874 0.0243345 -0.0542494 -0.1974166 -0.0882336 0.1021995 -0.0197717 0.0463172 0.005788 0.0585861 0.0020097 0.0975236 0.072069 0.076837 0.0461837 -0.0724519 -0.2265536 -0.0398777 0.0186346 -0.1744541 -0.0593178 0.117636 -0.0347515 0.01935 0.013317 -0.0658558 0.1131494 0.0129524 0.0835458 0.0452268 -0.0185326 0.0446644 0.0037795 -0.0556346 -0.0700115 -0.2085216 -0.1832606 -0.1346991 -0.1431298 -0.2136554 -0.0114394 0.017995 -0.040981 0.1004748 -0.0178485 0.0970053 0.0000619 0.0292088 -0.1510798 -0.0357369 0.0110505 -0.0242444 0.068984 0.009947 -0.0053155 0.0120922 0.1848515 0.2296264 -0.1398754 0.0227753 -0.2102463 0.2097504 0.0262828 0.0387843 0.0261428 0.3741759 unknown
polarizability: 147.8947741|2.0044184|118.972938|0.9090991|-5.1190907|62.7134359 unknown
InChI: InChI=1S/C9H13NO/c1-7-4-5-8(11)6-9(7)10(2)3/h4-6,11H,1-3H3
charge 0 multiplicity 1
24 atoms
O  -2.873417 1.577462 -0.142536
N  1.87966 0.528344 -0.220108
C  0.527591 0.076327 -0.106102
C  0.235839 -1.328855 -0.001314
C  -0.544069 1.009178 -0.157431
C  -1.118954 -1.721447 0.086657
C  -1.881751 0.573911 -0.08551
C  1.321815 -2.388322 -0.076773
C  2.116705 1.846464 -0.830115
C  2.805605 0.249842 0.897733
C  -2.188236 -0.797761 0.051534
H  -0.358427 2.083697 -0.231217
H  -1.348198 -2.792254 0.151793
H  1.741019 -2.650159 0.91569
H  0.921296 -3.321173 -0.511077
H  2.159163 -2.03954 -0.707538
H  1.505608 1.957642 -1.741014
H  3.182115 1.919123 -1.1160
H  1.89234 2.701476 -0.148583
H  2.619295 -0.745935 1.323544
H  2.696907 0.996088 1.719256
H  3.851026 0.283242 0.538166
H  -3.227767 -1.145062 0.104349
H  -3.773566 1.176311 -0.058104
