program: Gaussian 09
title: 000113611
version: EM64L-G09RevD.01
frameworkgroup: C1[X(C7H7ClO3)]
method: RPBEPBE
basis: SDD
operation: Freq
keyword: #p
keyword: freq=noraman
keyword: PBEPBE/SDD
title: #p freq=noraman PBEPBE/SDD
converged: NO NO NO NO
title: Mulliken charges:
elementType: Cl O O O C C C C C C C H H H H H H H
charge: -0.065701 -0.234342 -0.408733 -0.472607 0.252927 0.075781 0.319551 -0.341784 -0.274709 -0.264578 -0.537224 0.249024 0.249820 0.220202 0.250064 0.220202 0.386838 0.375269
chargesum: 0.00000
title: Mulliken charges with hydrogens summed into heavy atoms:
elementType: Cl O O O C C C C C C C
charge: -0.065701 -0.234342 -0.021895 -0.097338 0.252927 0.075781 0.319551 -0.092760 -0.274709 -0.014758 0.153244
polarizability: 1.43520146e+02 1.51542392e+00 1.04405472e+02 -1.54887764e-03 -4.10446604e-04 4.28438348e+01
1716.lowfreq: -10.3003 -6.8767 -0.0012 -0.0011 0.0017 10.3380 70.0670 117.8483 153.1401
frequency: 69.8888 117.8383 153.1373 181.4827 225.7068 231.6165 275.4302 285.5460 336.1117 339.5861 376.3704 380.9885 481.1137 483.9432 530.3754 567.3523 572.6297 620.1231 677.8852 721.1534 767.0238 847.6008 888.6385 908.0941 1034.1203 1112.1849 1121.9903 1141.0576 1165.4841 1209.9475 1229.1138 1252.0139 1310.6920 1419.3456 1434.6565 1445.9074 1466.5983 1472.1207 1499.6951 1595.0899 1619.6042 2952.6798 3037.7239 3126.0095 3161.9315 3181.2642 3510.6512 3541.4980
redmass: 3.5165 6.8817 6.6885 4.9436 6.4053 1.1957 4.2967 5.7242 4.5890 7.2505 5.5247 1.1508 9.1770 1.1155 4.1161 5.4174 5.2570 5.6816 6.3929 3.7355 1.7025 6.5383 1.3077 6.3411 4.7731 1.2604 2.1345 1.4111 1.2679 1.8083 2.7079 3.0622 1.6610 5.7972 1.3725 2.8247 1.0501 1.0744 3.3153 7.6736 7.2584 1.0337 1.1036 1.0987 1.0875 1.0964 1.0649 1.0655
irintensity: 4.9520 2.9419 2.2139 2.7116 9.1423 0.0051 10.6244 2.8596 5.9542 10.8365 2.0710 170.2624 0.5114 130.5244 0.1177 21.2505 4.7866 18.0471 6.3863 5.1431 54.0715 72.5389 0.0006 22.2266 233.3523 0.1437 0.3663 29.6237 13.2092 141.0939 127.4740 240.6289 71.2714 22.8344 27.0994 95.8593 14.2307 49.4469 83.7496 9.5992 42.0199 66.5825 50.9650 20.9800 3.2961 3.4262 78.7661 74.0539
temp: 298.150 k
press: 1.00000 atm
elementType: 17 8 8 8 6 6 6 6 6 6 6 1 1 1 1 1 1 1
symmnumber: 1
zpe: 335439.0 jmol-1
zpe.correction: 0.127762 hartree
zpe.thermalcorrener: 0.138540 hartree
zpe.thermalcorrenthalpy: 0.139485 hartree
zpe.thermalcorrgfe: 0.091443 hartree
zpe.sumelectzpe: -955.827385 hartree
zpe.sumelectthermal: -955.816606 hartree
zpe.sumelectthermalent: -955.815662 hartree
zpe.sumelectthermalfe: -955.863704 hartree
dipole: -0.1318 -1.9508 -0.0002
dipole: 1.9553
quadrupole: -62.5817 -65.2886 -73.6505
quadrupole: 12.6991 -0.0007 -0.0006
quadrupole: 4.5920 1.8850 -6.4769 12.6991 -0.0007 -0.0006
hfenergy: -955.9551468 hartree
pointgroup: C01 [X(C7H7Cl1O3)]
dipole: -0.1108255 0.7612451 0.0000872 debye
dipolederiv: -0.7685163 -0.1217964 -0.0000111 -0.1011823 -0.2004298 0.0000014 -0.0000178 0. -0.0529289 -1.7393286 0.1130331 -0.0000178 -0.0734736 -0.2765955 -0.0000019 -0.0000184 -0.0000016 -0.2753271 -0.1547543 -0.2373839 -0.000002 -0.2587905 -1.3155058 0.0000085 0.0000063 0.0000207 -0.3826665 -0.7844961 0.5163311 0.0000294 0.6117694 -0.7508024 0.0000343 0.0000619 -0.0000028 -0.4102407 1.5153151 0.1640895 0.0000201 0.2809462 -0.043821 0.0000048 0.0000188 0.0000067 0.0688596 -0.3045225 0.3997485 -0.0000019 0.3020486 1.1641025 -0.0000158 -0.0000103 -0.0000178 0.0446291 0.4798793 -0.7645708 -0.0000152 -0.4221903 0.3796179 -0.0000021 -0.0000423 0.000006 0.0305478 -0.2123969 0.0164622 0.0000014 -0.1361528 -0.0566446 -0.0000004 0.0000017 -0.0000026 -0.2181963 0.8911906 0.2217393 0.0000212 0.1978201 0.0547277 -0.0000008 0.0000429 0.0000007 -0.1023304 -0.1277144 -0.0703607 -0.0000033 -0.0854381 -0.0916117 -0.0000006 0.0000002 -0.0000019 -0.1088038 0.7407781 -0.1449491 0.0000029 -0.4646901 0.3462514 -0.0000041 0.000002 -0.0000003 0.3320615 -0.0119521 0.0863866 -0.0000037 0.086378 0.0214945 0.0000017 -0.0000055 0.000002 0.1731168 0.0758262 -0.0482693 -0.000001 -0.0468185 -0.0214642 0. -0.0000053 -0.0000008 0.1749419 0.0312471 -0.018288 -0.0507109 0.1498862 -0.0343018 -0.1156066 0.019541 -0.112235 -0.091801 -0.119634 -0.052259 -0.0000016 -0.1051004 0.054136 -0.0000007 -0.0000009 -0.0000002 0.1259195 0.0312478 -0.0182892 0.0507104 0.1498856 -0.0343053 0.1156099 -0.0195383 0.1122361 -0.091798 0.1625787 0.0433857 0.0000032 0.0635243 0.4464336 0.0000024 -0.0000029 -0.0000009 0.3909613 0.2952521 -0.0850097 -0.0000198 -0.1484218 0.3587185 -0.0000302 -0.0000332 -0.0000082 0.3930554 unknown
polarizability: 143.5208712|1.506038|104.4047475|0.0015759|-0.0002899|42.8438348 unknown
InChI: InChI=1S/C7H7ClO3/c1-11-5-3-2-4(8)6(9)7(5)10/h2-3,9-10H,1H3
charge 0 multiplicity 1
18 atoms
Cl 3.389102 1.1036 -0.000061
O  -2.490432 -0.299441 -0.000153
O  -0.589565 -2.253861 -0.000087
O  2.056152 -1.692353 -0.000117
C  -1.160158 0.122729 -0.000136
C  -0.189335 -0.91824 -0.000111
C  1.186228 -0.587343 -0.00009
C  -0.730893 1.474947 -0.000132
C  1.59063 0.763188 -0.000096
C  0.646229 1.79917 -0.000111
C  -3.521609 0.737394 -0.000145
H  -1.463702 2.285939 -0.000146
H  0.972444 2.842621 -0.000109
H  -3.456193 1.374672 0.904323
H  -4.47647 0.191915 -0.000149
H  -3.456191 1.374684 -0.904603
H  0.226461 -2.823025 -0.000083
H  3.001303 -1.391598 0.000006
