program: Gaussian 09
title: 000113449
version: EM64L-G09RevD.01
frameworkgroup: C1[X(C9H11ClO3S)]
method: RPBEPBE
basis: SDD
operation: Freq
keyword: #p
keyword: freq=noraman
keyword: PBEPBE/SDD
title: #p freq=noraman PBEPBE/SDD
converged: YES YES NO NO
title: Mulliken charges:
elementType: Cl S O O O C C C C C C C C C H H H H H H H H H H H
charge: -0.058303 0.965204 -0.399016 -0.510656 -0.503418 -0.188185 0.485468 -0.260153 -0.381451 -0.804110 -0.192817 -0.227586 -0.206498 -0.555052 0.299547 0.245562 0.271616 0.280727 0.220654 0.228259 0.260705 0.246859 0.238155 0.262351 0.282139
chargesum: 0.00000
title: Mulliken charges with hydrogens summed into heavy atoms:
elementType: Cl S O O O C C C C C C C C C
charge: -0.058303 0.965204 -0.399016 -0.510656 -0.503418 -0.188185 0.485468 0.039394 -0.135889 -0.031114 0.296147 0.019273 0.031657 -0.010561
polarizability: 1.73770496e+02 -9.13511069e+00 1.49209336e+02 -1.69599431e+01 -1.29468738e+01 9.92894858e+01
1716.lowfreq: -8.0225 -4.2701 -0.0012 0.0007 0.0016 2.6272 23.2688 43.2674 47.7575
frequency: 22.7547 43.2240 47.7170 72.9826 107.2346 134.7223 139.3570 173.6942 196.2074 218.1350 240.1408 245.2545 259.1409 303.3299 335.5615 384.4244 420.8242 448.9432 477.0384 513.8279 535.5521 563.5080 609.5790 646.3484 702.2612 769.1842 790.5842 819.3113 832.2925 878.2527 943.5502 950.3042 965.7613 983.6630 985.0075 996.2720 1000.3226 1042.4200 1054.4582 1070.0613 1134.5652 1168.8281 1175.2303 1213.4507 1215.9679 1278.5409 1296.6437 1355.1814 1368.1486 1410.6559 1422.2974 1430.2898 1460.0621 1461.3230 1463.9935 1483.0749 1566.9611 1607.8265 2966.1986 2990.9318 3038.8862 3061.2262 3075.1195 3104.3707 3135.8464 3145.8893 3149.4713 3158.1840 3174.5826
redmass: 6.5285 5.5123 6.0661 5.1177 9.1872 1.4879 3.2382 3.5088 3.1227 3.0106 6.1976 5.3675 4.9378 6.3949 4.5486 4.4487 4.1125 3.4959 7.9016 3.7216 6.2494 5.9508 4.7806 6.9494 3.4096 1.2160 4.9220 2.4133 16.0039 1.2759 2.0952 11.6346 1.3562 3.0200 2.4795 1.7567 1.3428 2.1108 1.5329 2.4543 1.4741 1.1736 1.0615 1.8231 1.3813 1.4848 1.1812 1.2900 5.0689 1.2555 2.1919 1.0961 1.0860 2.4594 1.0458 1.1059 5.2607 7.2296 1.0577 1.0373 1.1014 1.0602 1.0966 1.1002 1.0868 1.1096 1.0896 1.0945 1.1008
irintensity: 2.9476 1.7383 1.5448 2.0004 1.7624 5.0736 3.1745 4.3003 1.3069 4.5687 4.5373 1.3307 2.2077 8.3543 9.0911 9.2638 4.5901 19.1686 101.6210 2.3037 9.8018 99.6497 26.7304 4.6012 5.6011 76.1298 3.9492 37.0263 77.2395 0.0953 66.7654 83.6756 1.0748 13.5754 25.5884 1.6490 0.0415 3.8544 10.9135 7.9167 3.3420 17.1333 1.6167 11.1256 1.6025 8.0541 17.6490 4.4437 9.7575 20.4798 2.5021 10.9075 20.2627 20.6357 28.0626 28.2457 0.1408 4.3729 52.7689 9.8557 3.5822 23.8627 3.0570 14.3787 2.1398 6.7897 14.3302 1.9102 22.6385
temp: 298.150 k
press: 1.00000 atm
elementType: 17 16 8 8 8 6 6 6 6 6 6 6 6 6 1 1 1 1 1 1 1 1 1 1 1
symmnumber: 1
zpe: 481119.8 jmol-1
zpe.correction: 0.183249 hartree
zpe.thermalcorrener: 0.198512 hartree
zpe.thermalcorrenthalpy: 0.199456 hartree
zpe.thermalcorrgfe: 0.138892 hartree
zpe.sumelectzpe: -1432.113133 hartree
zpe.sumelectthermal: -1432.097870 hartree
zpe.sumelectthermalent: -1432.096926 hartree
zpe.sumelectthermalfe: -1432.157490 hartree
dipole: 1.3540 -2.2047 -2.2330
dipole: 3.4177
quadrupole: -77.2459 -102.1854 -101.2223
quadrupole: -12.1467 0.8948 -5.4280
quadrupole: 16.3053 -8.6342 -7.6710 -12.1467 0.8948 -5.4280
hfenergy: -1432.2963814 hartree
pointgroup: C01 [X(C9H11Cl1O3S1)]
dipole: -0.6385618 0.704515 -0.9507274 debye
dipolederiv: -0.2296878 0.0382026 0.0304204 -0.0581184 -0.515227 -0.0444067 0.0316599 -0.1109417 -0.1973519 1.9214731 -0.071709 -0.0430981 0.0708833 1.3893399 -0.1303922 -0.2716085 -0.153219 1.3089467 -1.246857 -0.0883434 0.1910724 -0.1072439 -0.4474048 0.061028 0.1548345 0.1002191 -0.5093119 -0.6552907 0.0525536 -0.0705088 0.0512057 -0.5010448 -0.0147647 0.0286388 0.0270163 -0.6434462 -0.6350517 0.0350576 -0.018965 -0.0415751 -0.7245987 0.026871 -0.029995 -0.0395776 -0.455618 0.0166939 -0.0969878 0.0494653 -0.1535929 -0.1031133 -0.0322742 0.0003865 0.0212126 -0.1919101 0.0438787 0.3411717 0.1277843 -0.0101771 0.0660962 0.0062192 0.003231 0.1560663 0.0875747 -0.0980883 -0.1247474 -0.0317706 0.2587752 -0.1243699 0.077809 0.0996562 -0.0707016 -0.0781748 -0.1959284 -0.192311 -0.0785848 0.0257351 0.0637291 0.0668769 -0.014714 -0.0370316 -0.1664044 -0.1807725 -0.1487826 -0.090052 -0.0673718 0.0425158 -0.0124366 -0.0651851 -0.0236935 -0.0669628 0.8822713 0.099115 -0.1413385 -0.3058601 0.0179341 0.1138481 0.2795148 0.0725556 0.0724894 -0.0460955 0.1537504 0.1079293 0.020888 -0.089251 0.0282614 0.0621781 0.0867628 -0.0919547 0.1089984 -0.0592569 0.0907439 -0.0609149 0.092772 0.0332084 0.082732 0.0323788 -0.0565675 -0.0081805 -0.1127156 0.0308068 0.1294667 0.724233 0.1143164 -0.071874 0.1359987 0.2456181 0.1731992 0.0412051 0.0021495 -0.0027375 0.0589013 -0.0272311 0.0024963 -0.0071236 0.1517307 0.0652157 0.0230676 -0.0317195 0.054766 -0.0754905 -0.0457134 -0.026748 -0.0536659 0.125994 0.1210347 -0.0253931 -0.0470437 -0.0321705 0.0730219 0.0819411 -0.0529469 0.0238509 0.0040102 0.0809268 -0.0295792 0.0296178 -0.0200313 0.0936851 -0.0449929 0.0402776 -0.0208449 0.0398529 0.0443959 0.1272947 0.0166035 0.0517025 -0.1073547 -0.0608492 -0.0171407 -0.0069353 0.1144 -0.1270402 -0.0274187 0.0394158 0.1222196 -0.1033675 -0.0614151 0.0501948 -0.0347016 0.0796051 0.0251515 -0.0252254 0.0432559 0.0351361 0.1065321 -0.0272892 -0.0983805 -0.0035955 -0.0328759 -0.0111497 -0.0415525 -0.09105 -0.0407838 0.0373331 -0.0594442 -0.1042853 -0.0562464 0.1065946 -0.0532634 0.0756889 -0.0713093 0.0844157 0.0653232 0.0131118 -0.0710788 0.0100342 0.123163 -0.1287652 0.0205023 0.016857 -0.0154872 -0.02454 -0.0169635 0.0047641 -0.0218948 0.0926161 0.1329316 0.0364132 -0.0606818 0.0108706 -0.0156548 -0.0453183 -0.0166079 -0.0259225 -0.0620175 unknown
polarizability: 174.9870416|-3.977546|148.7569376|17.4980112|12.1470173|98.5253386 unknown
InChI: InChI=1S/C9H11ClO3S/c1-8-4-2-3-5-9(8)14(11,12)13-7-6-10/h2-5H,6-7H2,1H3
charge 0 multiplicity 1
25 atoms
Cl 3.464311 2.198747 -0.14111
S  0.437211 -1.329943 0.598054
O  1.614592 -0.450744 -0.587421
O  0.934152 -0.980818 2.102812
O  0.310909 -2.883743 0.164032
C  -1.127693 -0.408962 0.079503
C  -1.293667 0.96041 0.395978
C  -2.064204 -1.206038 -0.60021
C  -2.529999 1.521405 -0.026279
C  -0.259077 1.802011 1.112211
C  3.028668 -0.600947 -0.194839
C  -3.276609 -0.604951 -1.001497
C  -3.503017 0.759678 -0.711148
C  3.808228 0.50287 -0.894427
H  -1.845782 -2.259724 -0.801525
H  -2.717959 2.578984 0.189609
H  0.005275 1.366536 2.091804
H  0.677956 1.858959 0.528372
H  -0.635903 2.82573 1.267796
H  3.412105 -1.581422 -0.546833
H  3.136689 -0.536689 0.905373
H  -4.028409 -1.196661 -1.53263
H  -4.441317 1.23389 -1.018436
H  4.891511 0.342695 -0.778608
H  3.535533 0.586528 -1.956177
