program: Gaussian 09
title: 000113408
version: EM64L-G09RevD.01
frameworkgroup: C1[X(C10H12N4)]
method: RPBEPBE
basis: SDD
operation: Freq
keyword: #pfreq=noraman
keyword: PBEPBE/SDD
title: #p freq=noraman PBEPBE/SDD
converged: YES YES NO NO
title: Mulliken charges:
elementType: N N N N C C C C C C C C C C H H H H H H H H H H H H
charge: -0.036303 -0.036092 -0.404240 -0.404163 0.091846 0.091814 0.062430 0.062121 -0.340914 -0.340891 -0.232396 -0.232450 -0.616931 -0.616893 0.249750 0.249770 0.296805 0.296804 0.225452 0.225470 0.258899 0.237753 0.207916 0.258658 0.238006 0.207776
chargesum: 0.00000
title: Mulliken charges with hydrogens summed into heavy atoms:
elementType: N N N N C C C C C C C C C C
charge: -0.036303 -0.036092 -0.107434 -0.107360 0.091846 0.091814 0.062430 0.062121 -0.091164 -0.091121 -0.006943 -0.006980 0.087638 0.087547
polarizability: 2.35206828e+02 -5.64573102e-03 1.48196425e+02 8.65206322e-03 1.78596074e+00 6.40031969e+01
1716.lowfreq: -5.6737 -0.0002 0.0007 0.0008 4.2895 8.1202 73.1898 90.4960 123.9287
frequency: 73.1853 90.4901 123.9276 131.4457 153.1420 154.0598 172.1952 213.2664 286.3034 336.7338 343.4254 351.1287 426.9035 466.2015 472.5803 484.6330 521.0822 563.9818 592.6031 602.1098 621.2806 686.2571 713.8139 731.1478 767.1626 784.0816 871.5404 885.2281 899.8597 953.8926 982.4426 1014.4230 1026.8119 1079.3372 1104.4556 1113.6780 1118.2184 1136.0832 1140.3942 1158.4649 1200.7456 1231.8192 1273.1215 1314.7549 1329.7860 1377.7916 1423.2691 1427.9554 1439.1283 1443.0003 1453.1535 1455.8188 1471.1500 1486.0728 1497.0171 1497.5912 1522.4314 1556.4613 1557.2793 1618.5487 2973.2380 2973.8831 3066.8658 3066.9133 3112.0038 3112.3184 3127.6726 3141.8563 3156.7025 3167.7901 3529.5862 3535.4591
redmass: 3.7241 3.3113 1.2538 1.1300 2.8352 2.4922 2.4781 4.2281 5.1393 3.5256 3.8936 4.5882 1.9631 3.6063 5.0720 3.3395 4.5834 3.6499 3.3282 1.7136 5.6654 3.5561 5.3305 6.1635 1.2811 4.5243 1.5766 3.0716 5.4493 1.3671 1.3072 2.0397 3.9496 3.7805 1.8010 1.3451 1.3458 1.5219 1.7024 1.1238 2.9434 1.8544 4.0458 2.0220 2.5454 8.3870 1.6033 1.2090 1.6241 1.4777 1.0706 1.4228 1.4739 1.1742 1.2821 2.8924 2.4441 5.4134 7.5345 6.9214 1.0406 1.0407 1.0926 1.0927 1.1019 1.1019 1.0851 1.0893 1.0952 1.1004 1.0763 1.0763
irintensity: 0.0057 4.8039 2.5613 0.0036 1.8826 0.1188 1.3962 2.5974 1.5262 22.8406 7.9138 1.2293 87.0132 2.2947 30.0672 7.6423 58.0715 0.8850 124.3959 124.6459 2.8175 10.6694 0.4862 4.1006 100.2914 1.7001 0.1217 0.0041 1.2055 3.4152 0.0000 11.4931 4.2364 4.9604 0.9836 13.3469 16.0051 0.1651 0.2495 1.9955 47.7352 3.3598 2.8475 2.7754 41.3948 8.4418 87.2273 5.3157 0.0247 75.5526 26.3906 16.8107 13.0537 7.6624 18.1067 15.0820 520.8786 8.7550 121.0654 2.8846 118.9055 35.0546 35.9446 33.3037 14.6144 24.0758 1.2854 9.7372 25.4216 32.6933 4.4543 48.0411
temp: 298.150 k
press: 1.00000 atm
elementType: 7 7 7 7 6 6 6 6 6 6 6 6 6 6 1 1 1 1 1 1 1 1 1 1 1 1
symmnumber: 1
zpe: 549619.2 jmol-1
zpe.correction: 0.209339 hartree
zpe.thermalcorrener: 0.222045 hartree
zpe.thermalcorrenthalpy: 0.222989 hartree
zpe.thermalcorrgfe: 0.170626 hartree
zpe.sumelectzpe: -606.268086 hartree
zpe.sumelectthermal: -606.255380 hartree
zpe.sumelectthermalent: -606.254436 hartree
zpe.sumelectthermalfe: -606.306799 hartree
dipole: 4.0464 0.0003 -0.0015
dipole: 4.0464
quadrupole: -61.5727 -77.4121 -86.2246
quadrupole: 0.0016 -0.0018 -0.9100
quadrupole: 13.4971 -2.3423 -11.1548 0.0016 -0.0018 -0.9100
hfenergy: -606.4774248 hartree
pointgroup: C01 [X(C10H12N4)]
dipole: 1.5919408 0.0091151 -0.005322 debye
dipolederiv: -0.5680779 -0.3862886 0.0154236 0.2019269 -0.2505295 -0.0050393 0.1194259 0.0548054 -0.259971 -0.570645 0.3829592 -0.0130459 -0.2055988 -0.2484269 -0.0036765 -0.1178213 0.0505287 -0.2589117 -1.3753326 -0.4794682 -0.1124605 -0.5007304 -0.6783233 0.1275409 -0.4062741 -0.0280991 -0.3887247 -1.3830168 0.4713263 0.1183761 0.492962 -0.6672733 0.1246496 0.4130235 -0.0262229 -0.3923999 0.2433879 0.3011799 -0.0129397 0.0094455 -0.0069712 0.0013407 0.0135238 -0.006446 0.0585173 0.2464313 -0.2981698 0.0115558 -0.0064148 -0.0105947 0.0015112 -0.0148966 -0.0043408 0.0585277 1.2865597 0.664281 -0.0160864 0.9246551 0.2555436 -0.0462235 -0.0264355 -0.0952906 0.1606148 1.3042271 -0.6528007 0.0080793 -0.9129534 0.2373948 -0.0391498 0.0191947 -0.0902137 0.1603495 0.0582075 -0.0930066 -0.0017971 -0.0315656 0.1131872 0.0270414 -0.0130856 0.0225101 -0.1660742 0.0570656 0.0924101 -0.0002044 0.0311106 0.1145913 0.0268061 0.0111859 0.0219236 -0.1661366 -0.1010874 -0.0431532 -0.008718 -0.2530262 0.00905 0.0220324 -0.0308256 0.0164401 -0.1709026 -0.1042979 0.0420067 0.0079308 0.2518848 0.0123417 0.0202182 0.0300683 0.016436 -0.1712174 0.2118459 0.023858 0.0496526 0.2488391 0.519383 -0.0652064 0.1176467 0.0280058 0.2082811 0.2150151 -0.0270569 -0.0484917 -0.2518227 0.5161661 -0.0627643 -0.1167024 0.0273752 0.2094156 0.089995 -0.0209416 -0.0020392 0.040865 -0.0859515 -0.0246975 0.0075546 -0.0200388 0.1555402 0.0901923 0.0228675 0.0028128 -0.0389933 -0.086127 -0.0243573 -0.0068044 -0.020246 0.1555787 0.2719328 0.0296763 0.049976 -0.0218095 0.1033475 -0.0680982 0.2160808 -0.0263079 0.2493289 0.2700705 -0.0279022 -0.0492973 0.0232599 0.1032476 -0.0687589 -0.2159392 -0.0284781 0.2511096 -0.1098515 0.0940459 0.0116337 0.10355 0.0348011 -0.0140919 0.0135526 -0.0134222 0.1603051 -0.1076915 -0.0957769 -0.0094322 -0.1052745 0.0325181 -0.0134226 -0.0113374 -0.0128351 0.1604932 0.0838648 0.0818505 0.091362 -0.0213767 0.0428421 -0.019631 0.0458055 -0.0633596 -0.0389367 0.0848225 0.0893855 -0.0918849 -0.0972174 -0.0818561 0.0632626 -0.0263615 0.1235781 -0.0851885 -0.1802199 -0.135902 -0.0234227 -0.0575675 0.029475 -0.000556 -0.020795 0.0072257 0.1173762 0.083948 -0.0813452 -0.0915232 0.0223904 0.0411793 -0.0212488 -0.0453942 -0.064079 -0.0394525 0.0849612 -0.0875178 0.0905997 0.0987812 -0.08097 0.063182 0.0244618 0.1236799 -0.0848646 -0.1823066 0.1334828 0.0239409 0.0546803 0.0319551 -0.0006632 0.0211486 0.0068713 0.1173426 unknown
polarizability: 235.2012176|0.5287588|148.0152065|-0.667094|4.3184731|64.1900261 unknown
InChI: InChI=1S/C10H12N4/c1-11-9-10(12-2)14-8-6-4-3-5-7(8)13-9/h3-6,11-12H,1-2H3
charge 0 multiplicity 1
26 atoms
N  0.207748 1.444707 0.037541
N  0.223555 -1.430541 -0.141766
N  2.571552 1.424282 -0.072335
N  2.58762 -1.383163 -0.049242
C  -0.986398 0.719569 0.024618
C  -0.978724 -0.719164 -0.119819
C  1.350365 0.750283 -0.041372
C  1.358633 -0.72308 -0.071159
C  -2.230535 1.408261 0.107926
C  -2.215339 -1.422252 -0.193909
C  -3.436526 0.69569 0.03879
C  -3.428952 -0.723739 -0.115656
C  2.610053 2.893519 -0.027191
C  2.642214 -2.851907 -0.094561
H  -2.209729 2.497556 0.216064
H  -2.182599 -2.511238 -0.302206
H  3.332665 0.952776 -0.566172
H  3.346953 -0.903101 0.439037
H  -4.39143 1.229551 0.100097
H  -4.378075 -1.268567 -0.16972
H  2.044552 3.247351 0.849486
H  2.147696 3.354202 -0.922558
H  3.659469 3.223023 0.057913
H  2.079913 -3.212278 -0.970689
H  2.18588 -3.31749 0.801313
H  3.695139 -3.16975 -0.180627
