program: Gaussian 09
title: 000113319
version: EM64L-G09RevD.01
frameworkgroup: C1[X(C13H16NO)]
method: RPBEPBE
basis: SDD
operation: Freq
keyword: #p
keyword: freq=noraman
keyword: PBEPBE/SDD
title: #p freq=noraman PBEPBE/SDD
converged: YES YES NO NO
title: Mulliken charges:
elementType: O N C C C C C C C C C C C C C H H H H H H H H H H H H H H H H
charge: -0.438054 -0.164167 -0.445147 0.225010 0.343754 -0.354341 0.380517 -0.312174 -0.243938 -0.297659 -0.313577 -0.782685 -0.357137 -0.221796 -0.228606 0.263423 0.256849 0.256371 0.236528 0.269034 0.281442 0.266721 0.196059 0.197738 0.269878 0.271953 0.272727 0.266243 0.265717 0.270971 0.368346
chargesum: 1.00000
title: Mulliken charges with hydrogens summed into heavy atoms:
elementType: O N C C C C C C C C C C C C C
charge: -0.069707 -0.164167 0.075125 0.225010 0.343754 0.138558 0.380517 -0.043139 0.037504 -0.030938 0.080220 0.031872 -0.090894 0.043921 0.042365
polarizability: 1.81650668e+02 1.82590876e+01 1.85421089e+02 1.62800274e+01 -8.01379569e+00 8.27587092e+01
1716.lowfreq: -11.1536 -0.0006 -0.0004 0.0006 8.4083 10.4931 36.3188 57.2015 63.6020
frequency: 36.2465 57.1970 63.5854 110.6934 131.2729 154.8546 197.9524 216.6803 237.5707 288.6555 301.1465 325.3615 386.6814 413.5074 437.6310 445.9057 485.3959 511.2589 517.6886 541.3381 595.2678 657.0564 688.4857 723.3990 758.6302 775.3379 782.3764 842.2568 849.7323 857.2821 883.0742 912.3335 971.8258 981.3758 1000.5270 1008.6039 1014.0199 1024.5429 1038.4064 1042.3637 1049.8811 1066.2928 1126.7336 1162.3074 1174.2681 1186.9092 1195.1653 1217.2867 1236.3711 1252.7845 1270.7782 1285.8411 1290.7832 1301.4533 1335.9154 1362.9852 1384.7508 1405.8934 1420.9021 1429.2972 1429.8399 1462.9053 1468.6493 1469.9802 1482.4221 1491.1540 1524.5366 1532.2555 1573.4865 1600.5668 1623.9307 2932.6612 2978.3152 2991.6671 3016.1068 3056.8014 3073.6469 3075.6123 3113.7101 3122.8879 3153.7934 3160.4821 3163.0529 3183.3786 3194.4373 3196.2096 3581.1681
redmass: 5.4315 4.1296 2.1645 3.3224 2.8547 3.1593 1.1323 3.5428 3.6220 1.0702 3.4460 3.8431 3.0259 2.8348 5.1386 3.3008 3.3237 3.1929 5.0531 3.6784 5.2225 3.7984 5.3353 4.6978 1.5461 2.0981 1.1790 1.3052 4.4316 1.7041 1.5061 1.8822 1.3446 4.7203 1.3930 1.7629 1.3779 3.2469 2.2053 1.8634 2.5148 3.0247 1.6918 1.5169 1.2808 1.6273 1.1332 1.2310 2.0974 1.6776 1.5032 1.1316 1.4671 1.4732 2.0026 1.4782 2.7713 1.2262 7.5356 1.5768 1.7063 1.6962 1.3566 1.0678 1.0729 1.0838 1.0911 3.6153 5.9219 6.5057 6.3308 1.0546 1.1070 1.0420 1.0603 1.0623 1.1011 1.0965 1.1031 1.0980 1.0896 1.0922 1.0912 1.0971 1.0970 1.0967 1.0669
irintensity: 1.5834 0.8066 10.0469 1.5095 1.5490 0.3380 2.0849 1.1569 0.7321 163.0802 0.9267 1.3365 2.2551 1.6472 0.8645 36.1119 3.2740 0.0206 1.8644 2.7905 1.9680 0.8968 0.5966 3.1074 21.0991 44.4954 6.2856 37.5150 7.1792 1.7376 12.3534 0.3073 1.2650 96.8904 1.5444 2.2626 0.2660 3.0377 0.1154 2.5035 13.9622 3.9035 1.2977 9.6717 3.3186 10.1849 2.8395 45.6474 6.6043 7.8868 10.8975 3.0586 4.7155 20.4819 5.9346 19.2851 16.7889 33.1721 22.9710 18.4384 3.5044 8.6631 11.7556 13.7166 14.3603 6.9402 16.1188 70.5014 19.2010 80.0238 22.1410 65.1029 44.1778 0.3223 8.9341 15.4594 12.8198 1.4094 10.8960 2.8742 0.1745 0.1368 0.9940 3.5746 0.0242 1.9071 16.8712
temp: 298.150 k
press: 1.00000 atm
elementType: 8 7 6 6 6 6 6 6 6 6 6 6 6 6 6 1 1 1 1 1 1 1 1 1 1 1 1 1 1 1 1
symmnumber: 1
zpe: 688318.0 jmol-1
zpe.correction: 0.262166 hartree
zpe.thermalcorrener: 0.276089 hartree
zpe.thermalcorrenthalpy: 0.277033 hartree
zpe.thermalcorrgfe: 0.220937 hartree
zpe.sumelectzpe: -633.634534 hartree
zpe.sumelectthermal: -633.620612 hartree
zpe.sumelectthermalent: -633.619668 hartree
zpe.sumelectthermalfe: -633.675764 hartree
dipole: -1.1387 2.0053 2.1994
dipole: 3.1867
quadrupole: -44.8971 -56.6217 -90.0238
quadrupole: 1.1312 12.1586 -4.2180
quadrupole: 18.9505 7.2258 -26.1763 1.1312 12.1586 -4.2180
hfenergy: -633.896701 hartree
pointgroup: C01 [X(C13H16N1O1)]
dipole: 0.4070807 0.797855 -0.8772485 debye
polarizability: 183.6038076|-18.099611|183.3792435|17.3984477|6.6953437|82.8474151 unknown
InChI: InChI=1S/C13H16NO/c1-11-7-8-12-5-2-3-6-13(12)14(11)9-4-10-15/h2-3,5-8,15H,4,9-10H2,1H3
charge 1 multiplicity 1
31 atoms
O  -4.456519 -1.616967 1.005999
N  -0.338905 0.620512 -0.417882
C  -1.639855 0.031977 -0.891836
C  0.76364 -0.246185 -0.216808
C  -0.260464 1.970506 -0.155403
C  -2.474418 -0.537747 0.275029
C  2.015525 0.315887 0.237693
C  0.967178 2.522364 0.3023
C  2.089467 1.717405 0.489986
C  0.676649 -1.649834 -0.448713
C  -3.803133 -1.138613 -0.210997
C  -1.4580 2.863983 -0.361134
C  3.145826 -0.541545 0.431313
C  1.802105 -2.459554 -0.248383
C  3.045155 -1.911167 0.189802
H  -2.197934 0.819932 -1.418983
H  -1.409827 -0.741155 -1.642633
H  -1.916659 -1.323443 0.815647
H  -2.705337 0.25373 1.011761
H  1.005689 3.59521 0.500297
H  3.031854 2.153644 0.837124
H  -0.252452 -2.121879 -0.771199
H  -3.617231 -1.969481 -0.927091
H  -4.415307 -0.365756 -0.726002
H  -2.360882 2.489443 0.15128
H  -1.240767 3.867021 0.03482
H  -1.702999 2.981404 -1.434114
H  4.088027 -0.100454 0.773005
H  1.722202 -3.536031 -0.428952
H  3.90774 -2.567002 0.336675
H  -5.33437 -2.022105 0.7938
