program: Gaussian 09
title: 000008368
version: EM64L-G09RevD.01
frameworkgroup: C1[X(C7H6Cl2)]
method: RPBEPBE
basis: SDD
operation: Freq
keyword: #pfreq=noraman
keyword: PBEPBE/SDD
title: #p freq=noraman PBEPBE/SDD
converged: NO YES NO YES
title: Mulliken charges:
elementType: Cl Cl C C C C C C C H H H H H H
charge: -0.056138 -0.056149 0.565131 -0.255554 -0.255581 -0.767387 -0.234150 -0.234153 -0.211019 0.253506 0.244381 0.244383 0.260820 0.260822 0.241086
chargesum: 0.00000
title: Mulliken charges with hydrogens summed into heavy atoms:
elementType: Cl Cl C C C C C C C
charge: -0.056138 -0.056149 0.565131 -0.255554 -0.255581 -0.025116 0.026671 0.026669 0.030066
polarizability: 1.23602675e+02 -6.59533485e-04 1.05622941e+02 -8.31839543e-05 -4.90645844e-01 3.99538385e+01
1716.lowfreq: -66.8624 -10.7603 -7.4062 -0.0023 -0.0015 0.0005 8.1868 98.9206 195.6175
frequency: -66.7652 98.9205 195.6171 203.8944 245.4786 294.6841 348.3407 380.6435 472.6770 504.2256 519.9992 566.3637 695.2022 719.1861 774.0293 793.4152 892.8399 965.5809 999.7245 1038.3785 1042.0205 1069.3667 1155.4429 1204.9412 1217.0376 1356.1469 1400.7078 1412.5505 1435.2933 1464.2621 1469.8881 1562.2048 1593.4645 2990.3694 3078.4944 3119.3369 3149.6950 3170.3018 3181.7081
redmass: 1.0676 5.6777 4.5580 15.5332 3.9596 3.3227 14.3805 6.1177 4.3241 3.2448 5.4760 6.3352 2.9326 7.2474 1.3895 4.8899 1.3582 1.3297 1.4859 1.5556 4.7268 2.5400 1.2760 1.4929 2.5737 7.3401 1.2527 2.1654 2.7575 1.0837 1.1109 5.9034 7.9986 1.0416 1.0912 1.1005 1.0873 1.0930 1.0999
irintensity: 0.7656 1.1239 0.0007 0.8017 7.5966 0.9711 4.0187 6.6441 1.6678 0.2579 0.0282 0.8940 15.4413 74.3790 63.1890 0.1179 0.0005 0.4759 52.5517 11.3569 13.0624 17.9727 1.9698 4.0006 0.4271 8.2124 25.8346 43.2018 14.9162 21.3913 21.4904 57.5800 7.5241 10.8594 12.6540 3.6135 3.8982 1.3619 6.4428
temp: 298.150 k
press: 1.00000 atm
elementType: 17 17 6 6 6 6 6 6 6 1 1 1 1 1 1
symmnumber: 1
zpe: 279821.1 jmol-1
zpe.correction: 0.106578 hartree
zpe.thermalcorrener: 0.114449 hartree
zpe.thermalcorrenthalpy: 0.115393 hartree
zpe.thermalcorrgfe: 0.073154 hartree
zpe.sumelectzpe: -1189.817708 hartree
zpe.sumelectthermal: -1189.809838 hartree
zpe.sumelectthermalent: -1189.808893 hartree
zpe.sumelectthermalfe: -1189.851132 hartree
dipole: 0.0001 1.2659 0.0573
dipole: 1.2672
quadrupole: -70.6116 -57.3545 -69.1405
quadrupole: -0.0002 0.0000 -0.0529
quadrupole: -4.9094 8.3477 -3.4383 -0.0002 0.0000 -0.0529
hfenergy: -1189.9242863 hartree
pointgroup: C01 [X(C7H6Cl2)]
dipole: -0.0000839 0.4980435 -0.0224343 debye
dipolederiv: -0.6828976 -0.2476107 -0.0016333 -0.2667166 -0.2580014 -0.0018729 -0.0044856 0.0024117 -0.0688534 -0.683015 0.2475251 0.0016074 0.2666263 -0.2579001 -0.0018597 0.0044534 0.0024268 -0.068856 -0.5270972 -0.0000527 -0.0000129 -0.0000438 0.2007015 0.0091023 -0.0000176 0.0499713 0.0394348 1.0033142 0.4028687 0.0104041 0.3541746 0.2756299 0.0089328 0.0127847 0.0005876 -0.0804545 1.0034729 -0.402716 -0.0103565 -0.354039 0.275472 0.0089108 -0.0127284 0.0005612 -0.0804438 0.023042 -0.0000475 0. 0.000003 -0.1814301 -0.0117938 0.0000102 -0.0745592 0.0505906 -0.1951476 -0.1218214 -0.0037012 -0.1271003 -0.152964 0.0021996 -0.0030625 -0.0023286 -0.1105696 -0.1952011 0.1218086 0.0036927 0.127093 -0.1529118 0.0022053 0.0030519 -0.0023251 -0.1105692 0.1004599 0.0000067 0.0000046 0.0000035 0.0670409 -0.0047878 0.0000041 0.0022738 -0.1529562 0.1245133 -0.0000008 -0.0000459 0.0000025 0.0120861 -0.0403346 -0.0000316 -0.0737704 -0.0745474 -0.0056373 0.0876057 -0.0919092 0.020596 0.0666356 0.0139732 -0.0633694 0.0468317 0.07615 -0.0055667 -0.0875677 0.0919562 -0.0206024 0.0665918 0.0139978 0.0633962 0.0468673 0.0760868 -0.0112961 0.0659857 0.0001273 0.0490245 0.0668394 0.000382 -0.0012457 0.000346 0.1697074 -0.0112702 -0.0659993 -0.0001314 -0.0490373 0.0668184 0.0003807 0.0012402 0.0003459 0.1697086 0.0623264 0.0000155 -0.0000019 0.0000159 -0.0946083 0.0005642 0.0000001 0.00036 0.1655719 unknown
polarizability: 123.6026745|0.0026022|105.6227003|0.0013574|0.5065504|39.95408 unknown
InChI: InChI=1S/C7H6Cl2/c1-5-6(8)3-2-4-7(5)9/h2-4H,1H3
charge 0 multiplicity 1
15 atoms
Cl -2.808076 -0.874564 -0.007027
Cl 2.808303 -0.873986 -0.006921
C  0.000092 -0.779077 0.013024
C  -1.195261 -0.010513 0.006296
C  1.195297 -0.010276 0.006323
C  0.000214 -2.292633 0.011434
C  -1.223045 1.397595 0.001816
C  1.222806 1.397842 0.001847
C  -0.000191 2.102674 0.001339
H  0.000017 -2.681948 -1.024924
H  0.899446 -2.686806 0.510519
H  -0.89876 -2.686935 0.510894
H  -2.180001 1.926467 -0.001506
H  2.179658 1.926899 -0.001452
H  -0.000299 3.197161 -0.000562
