program: Gaussian 09
title: 000113304
version: EM64L-G09RevD.01
frameworkgroup: C1[X(C16H18N4OS2)]
method: RPBEPBE
basis: SDD
operation: Freq
keyword: #p
keyword: freq=noraman
keyword: PBEPBE/SDD
title: #p freq=noraman PBEPBE/SDD
converged: YES YES NO NO
title: Mulliken charges:
elementType: S S O N N N N C C C C C C C C C C C C C C C C H H H H H H H H H H H H H H H H H H
charge: 0.134654 0.134743 -0.304372 -0.602521 -0.602518 -0.345984 -0.345982 0.555514 0.555506 0.333131 0.333191 -0.350278 -0.350083 -0.384972 -0.384941 -0.353392 -0.353679 -0.386819 -0.386815 -0.885403 -0.885494 -0.064727 -0.064643 0.273019 0.273020 0.233359 0.233386 0.265733 0.265770 0.254474 0.254517 0.271457 0.328957 0.271492 0.329034 0.329903 0.317904 0.329921 0.317927 0.227994 0.228016
chargesum: 0.00000
title: Mulliken charges with hydrogens summed into heavy atoms:
elementType: S S O N N N N C C C C C C C C C C C C C C C C
charge: 0.134654 0.134743 -0.304372 0.045286 0.045330 -0.117990 -0.117965 0.555514 0.555506 0.333131 0.333191 -0.077259 -0.077063 -0.151613 -0.151554 -0.087659 -0.087909 -0.132345 -0.132298 -0.284989 -0.284967 -0.064727 -0.064643
polarizability: 3.17929802e+02 1.08756404e-02 2.77590483e+02 -2.45874964e+01 6.53354472e-02 1.73616543e+02
1716.lowfreq: -5.5494 -2.2313 0.0012 0.0018 0.0018 0.5639 9.0438 15.1323 15.3522
frequency: 8.9604 15.1175 15.3286 22.5587 36.4798 39.3235 44.2258 48.2986 68.5294 80.4712 106.2634 164.8211 174.6813 180.6372 195.7825 267.1010 282.8652 318.2788 329.6982 332.9608 340.4098 353.2274 390.0897 403.7514 404.4310 411.2651 411.9988 415.0181 415.8904 457.2802 457.3523 484.4270 488.7918 530.9274 555.9808 556.0886 584.9647 585.4582 588.0990 618.9545 621.9963 630.4187 636.5485 691.3928 717.7134 718.6369 732.2989 752.6901 782.4627 813.9147 831.7771 837.3737 845.3657 857.5841 862.9554 884.2420 885.5058 955.7434 956.5361 979.0720 985.2262 986.0858 987.1846 1007.2592 1008.0523 1043.7704 1043.7864 1104.8561 1107.6368 1152.1526 1173.2093 1179.3138 1180.4179 1191.9769 1213.8601 1225.2804 1231.0256 1250.2641 1250.6762 1285.0791 1285.3790 1299.4921 1308.4457 1375.1176 1387.1761 1414.8904 1419.5151 1441.6853 1441.8074 1487.6084 1495.7824 1581.5285 1592.4588 1608.7349 1612.6808 1613.2496 1621.9625 1639.0950 1639.4049 3013.0100 3013.2448 3105.8366 3105.8810 3126.1344 3126.3093 3137.0952 3137.8615 3159.6502 3162.0113 3167.5080 3167.9394 3375.0649 3375.2045 3526.5085 3526.5375 3674.5713 3674.5830
redmass: 5.2178 6.6625 6.6312 4.5447 4.9139 5.2412 7.0444 4.0203 3.9421 10.0573 7.2216 7.1794 7.2178 6.1972 6.8491 3.6547 3.1352 3.7942 1.4026 1.0608 2.0186 2.7926 3.0472 2.9659 2.6968 1.7412 2.2908 1.5589 2.8182 6.7362 6.8234 4.0142 4.2877 4.4451 2.9953 2.9941 2.8157 2.9442 4.3961 4.3872 5.1744 6.1514 6.5244 5.1213 1.4434 1.4395 3.8024 4.3583 4.3611 4.4084 1.2757 1.3511 1.7497 4.8947 1.5709 1.7343 1.7434 1.3601 1.3604 1.3521 1.5457 1.7125 1.4556 2.7540 2.8749 1.5736 1.5720 1.3327 1.3170 2.2375 1.2154 1.0890 1.0941 1.3501 2.2571 3.4183 5.9032 1.1865 1.2088 2.7087 2.7085 1.3280 1.2811 4.6657 6.3588 3.2652 3.0834 1.1275 1.1298 2.5711 2.6654 7.1080 7.2556 4.1192 1.4310 1.5937 6.1855 3.0083 3.0388 1.0615 1.0614 1.1042 1.1042 1.0897 1.0897 1.0894 1.0896 1.0960 1.0952 1.0954 1.0956 1.0770 1.0770 1.0448 1.0448 1.1043 1.1043
irintensity: 0.2418 2.0704 3.2308 4.9960 0.0984 20.0655 0.0557 1.9889 0.0544 2.6312 0.4553 0.0378 7.0632 4.5093 18.1123 11.3936 3.0777 3.9674 0.0098 47.6204 0.7963 8.2794 2.5245 115.7474 3.0678 282.0693 190.6021 1.3924 0.4758 1.1446 4.4516 4.7482 14.8033 72.8840 2.5894 33.5813 60.7892 92.6832 0.0368 32.0327 22.4591 7.0237 18.7780 4.7849 182.5929 2.9028 11.6423 3.0841 11.2532 1.6140 6.2178 8.2581 70.5568 67.5429 24.9282 22.3024 0.0682 0.2630 0.0712 1.8302 33.6901 208.0092 18.8895 19.1128 0.0858 2.5655 8.2250 10.9876 12.5375 8.6132 101.3764 0.0642 28.7773 3.9545 219.7656 9.0018 426.7828 43.2987 2.0875 60.1621 306.8991 7.6699 0.0048 2.3760 0.9659 0.7581 2.0271 28.0014 18.6975 359.3681 22.4805 0.4459 2.6824 133.2737 174.1418 21.0688 0.7365 57.1119 435.0434 22.8378 25.3240 17.5263 0.9220 33.4996 5.9336 3.7162 0.0041 14.6703 1.1000 2.1410 11.1073 15.8166 22.2587 31.2591 38.8264 27.0775 18.5626
temp: 298.150 k
press: 1.00000 atm
elementType: 16 16 8 7 7 7 7 6 6 6 6 6 6 6 6 6 6 6 6 6 6 6 6 1 1 1 1 1 1 1 1 1 1 1 1 1 1 1 1 1 1
symmnumber: 1
zpe: 823204.8 jmol-1
zpe.correction: 0.313542 hartree
zpe.thermalcorrener: 0.337484 hartree
zpe.thermalcorrenthalpy: 0.338428 hartree
zpe.thermalcorrgfe: 0.253536 hartree
zpe.sumelectzpe: -1709.165670 hartree
zpe.sumelectthermal: -1709.141729 hartree
zpe.sumelectthermalent: -1709.140784 hartree
zpe.sumelectthermalfe: -1709.225676 hartree
dipole: -0.0047 6.6079 0.0022
dipole: 6.6079
quadrupole: -141.0210 -107.5495 -151.6929
quadrupole: -0.0339 -10.4302 0.0859
quadrupole: -7.5999 25.8716 -18.2717 -0.0339 -10.4302 0.0859
hfenergy: -1709.4792122 hartree
pointgroup: C01 [X(C16H18N4O1S2)]
dipole: 0.002404 -2.5997557 -0.0012806 debye
polarizability: 314.1281972|-0.0056649|277.5905148|33.7448517|0.0299259|177.4181163 unknown
InChI: InChI=1S/C16H18N4OS2/c17-15(18)22-9-11-1-5-13(6-2-11)21-14-7-3-12(4-8-14)10-23-16(19)20/h1-8,17,19H,9-10,18,20H2
charge 0 multiplicity 1
41 atoms
S  5.481211 -1.085912 1.171025
S  -5.47653 -1.091172 -1.177656
O  -0.001992 2.734805 0.007526
N  5.338013 -3.753686 0.926288
N  -5.326727 -3.758122 -0.927684
N  4.897236 -2.505667 -1.11662
N  -4.903702 -2.505476 1.116174
C  3.817767 0.879911 -0.104507
C  -3.821487 0.87853 0.102591
C  1.234039 2.040457 -0.010835
C  -1.238019 2.040173 0.019663
C  2.714092 0.2458 -0.735369
C  -2.720903 0.246626 0.741155
C  3.600062 2.113128 0.56266
C  -3.600966 2.110155 -0.566509
C  1.426064 0.816304 -0.695842
C  -1.433072 0.817824 0.706998
C  2.316791 2.695516 0.614607
C  -2.317666 2.693106 -0.61315
C  5.187205 0.255841 -0.167148
C  -5.190859 0.25361 0.159134
C  5.189839 -2.608047 0.150828
C  -5.187189 -2.610821 -0.153104
H  2.883696 -0.701923 -1.25895
H  -2.892935 -0.699719 1.2664
H  4.440878 2.621644 1.049903
H  -4.439445 2.616959 -1.059528
H  0.586747 0.328573 -1.201345
H  -0.596078 0.332172 1.218366
H  2.137793 3.647339 1.123454
H  -2.136462 3.643715 -1.12348
H  5.996865 0.982828 0.001737
H  5.348844 -0.302188 -1.10616
H  -6.000082 0.97964 -0.015911
H  -5.357421 -0.302324 1.098506
H  5.567354 -3.693728 1.917049
H  5.208256 -4.674642 0.512456
H  -5.547907 -3.700398 -1.920432
H  -5.198597 -4.678078 -0.511123
H  4.770466 -3.400168 -1.624298
H  -4.777178 -3.398789 1.62603
