program: Gaussian 09
title: 000113293
version: EM64L-G09RevD.01
frameworkgroup: C1[X(C17H22N2O2)]
method: RPBEPBE
basis: SDD
operation: Freq
keyword: #p
keyword: freq=noraman
keyword: PBEPBE/SDD
title: #p freq=noraman PBEPBE/SDD
converged: YES YES NO NO
title: Mulliken charges:
elementType: O O N N C C C C C C C C C C C C C C C C C H H H H H H H H H H H H H H H H H H H H H H
charge: -0.467496 -0.530650 -0.158103 -0.158547 -0.765083 0.412944 0.390809 0.087987 0.205069 0.432823 0.446602 -0.405061 -0.375149 -0.505618 -0.556586 -0.407567 -0.398427 -0.644714 -0.646850 -0.642496 -0.648456 0.221070 0.246943 0.208608 0.226451 0.252888 0.227620 0.228835 0.235865 0.228569 0.211085 0.228107 0.232129 0.231570 0.210087 0.234698 0.215116 0.232759 0.219665 0.230717 0.229122 0.411721 0.370946
chargesum: 0.00000
title: Mulliken charges with hydrogens summed into heavy atoms:
elementType: O O N N C C C C C C C C C C C C C C C C C
charge: -0.055776 -0.159705 -0.158103 -0.158547 -0.297070 0.412944 0.390809 0.087987 0.205069 0.432823 0.446602 -0.196453 -0.148698 -0.252730 -0.328966 -0.178732 -0.162562 0.023048 0.026936 0.040078 0.031047
polarizability: 3.04679783e+02 -7.57406650e+00 1.94152696e+02 4.55754496e+00 -1.67765213e+01 1.59926651e+02
1716.lowfreq: 0.0003 0.0005 0.0007 4.5743 11.1252 19.3931 23.7539 28.0066 53.4587
frequency: 23.7523 27.8713 53.4511 60.7695 66.7751 75.5465 96.1875 101.1072 128.4377 157.5589 167.2846 179.8850 204.2103 216.0097 226.7742 241.8514 251.9334 260.2057 308.5958 326.5942 350.3273 353.8732 356.2969 381.3278 395.6073 427.5805 448.7620 459.4427 500.9886 523.0623 539.3909 544.7958 556.5309 568.1370 617.0995 627.4537 673.1635 694.2936 701.4179 714.1066 733.8365 763.2957 775.7843 780.1612 803.3204 814.1997 844.6881 876.5555 887.2208 915.8255 924.9243 941.5550 974.8417 977.8834 1057.7703 1060.1089 1072.2206 1103.6827 1108.8004 1110.6854 1111.6594 1112.0875 1143.7406 1156.0324 1164.0745 1185.9828 1201.9062 1209.1057 1217.4831 1230.9038 1266.8881 1268.4534 1279.6387 1306.1068 1312.3530 1344.3049 1360.5641 1362.7610 1389.3257 1394.4062 1426.8463 1432.3670 1440.9056 1456.2879 1461.0890 1461.6649 1463.4212 1466.9396 1471.2631 1474.6354 1485.7814 1495.2951 1498.2785 1507.0770 1509.1175 1523.1110 1533.4646 1563.9447 1580.3056 1641.4398 1647.7826 2927.5137 2929.7253 2937.0557 2942.6465 2987.8093 2988.4554 2989.9165 2991.9335 3002.6528 3044.1588 3089.6545 3093.9315 3098.2427 3103.6667 3103.8411 3124.7654 3136.5606 3166.3799 3170.9224 3177.6000 3251.8756 3612.2966
redmass: 4.4421 3.9491 2.7561 2.6281 3.1494 2.6142 2.1220 2.4974 1.9689 4.2987 1.5598 1.6972 1.3816 1.5665 3.3546 3.6529 3.8559 3.4913 3.8448 4.1272 1.9840 1.6068 3.1078 3.3769 3.6178 3.5176 2.7303 2.9886 3.8601 3.4883 3.5921 3.8540 4.8719 5.7768 3.5585 3.5668 3.1213 5.6020 2.6526 4.5920 1.0941 1.7647 2.7994 1.8146 2.5417 2.2453 1.8144 4.3847 4.5181 1.8090 1.4959 1.3782 2.4760 2.4660 1.4959 1.4968 2.6738 2.3331 1.3152 1.3145 1.2405 1.2414 1.5775 1.4956 1.3081 1.0927 1.8427 1.9206 1.9280 2.3927 3.1851 2.5982 1.7053 1.5046 1.4581 1.6245 3.1642 3.4783 5.6245 4.4029 1.6336 1.1592 1.8184 1.3283 1.0441 1.2437 1.0404 1.5356 1.0473 1.0463 1.2223 1.0969 1.2310 1.2257 1.1123 2.2179 2.8991 6.7110 6.4929 6.2997 6.5544 1.0371 1.0378 1.0397 1.0391 1.0994 1.0603 1.1004 1.1021 1.1015 1.1008 1.0949 1.0955 1.0932 1.0933 1.0894 1.0892 1.0900 1.0924 1.0933 1.0904 1.0701 1.0659
irintensity: 1.4479 1.6055 1.5491 3.1503 0.7904 4.8843 0.6425 2.4233 0.9236 1.1351 0.2649 1.1933 0.5225 0.4787 3.6925 6.9365 0.3608 1.0761 5.5567 9.1763 44.3735 55.5991 7.1471 0.9239 7.2148 3.7478 11.4815 4.7168 4.2194 7.4806 12.5458 0.9959 6.4015 2.8378 8.3766 17.8759 11.9496 4.6379 2.8317 1.4335 166.5156 23.0116 22.2102 25.1399 62.2619 26.2836 22.7280 4.3009 1.3229 6.0203 2.2820 0.8008 31.0278 28.8414 26.7708 28.1380 97.2202 50.6799 1.9544 1.0736 0.0488 0.0202 69.8737 4.5765 11.0166 20.6331 15.4911 3.5740 105.5046 30.8273 22.8906 62.2816 34.7552 11.4911 31.1481 54.1254 102.8928 59.8586 47.5836 10.3567 0.8499 2.3249 6.1874 36.7673 0.9615 18.2872 0.2053 15.0728 17.4826 20.1831 8.5537 4.4492 5.3016 11.6233 36.8942 368.1230 185.9446 56.0626 82.7772 415.4126 104.8980 125.7494 116.2766 105.4102 89.8403 20.3547 30.2915 42.6968 85.9469 56.5443 7.6064 5.0325 3.8586 63.7028 50.8835 17.6195 14.0850 11.9376 20.3421 15.6281 9.5426 873.9257 34.6245
temp: 298.150 k
press: 1.00000 atm
elementType: 8 8 7 7 6 6 6 6 6 6 6 6 6 6 6 6 6 6 6 6 6 1 1 1 1 1 1 1 1 1 1 1 1 1 1 1 1 1 1 1 1 1 1
symmnumber: 1
zpe: 936474.0 jmol-1
zpe.correction: 0.356684 hartree
zpe.thermalcorrener: 0.378299 hartree
zpe.thermalcorrenthalpy: 0.379244 hartree
zpe.thermalcorrgfe: 0.305330 hartree
zpe.sumelectzpe: -919.377846 hartree
zpe.sumelectthermal: -919.356230 hartree
zpe.sumelectthermalent: -919.355286 hartree
zpe.sumelectthermalfe: -919.429199 hartree
dipole: -4.0502 -1.4460 -2.1538
dipole: 4.8097
quadrupole: -84.8322 -116.9217 -123.9529
quadrupole: -8.2901 3.4001 -4.6195
quadrupole: 23.7367 -8.3528 -15.3840 -8.2901 3.4001 -4.6195
hfenergy: -919.7345297 hartree
pointgroup: C01 [X(C17H22N2O2)]
dipole: 1.5639456 1.0447709 -0.2080999 debye
polarizability: 305.2645293|1.9459581|163.2184803|-4.109739|19.3350895|190.2761201 unknown
InChI: InChI=1S/C17H22N2O2/c1-18(2)14-7-5-12(16(20)10-14)9-13-6-8-15(19(3)4)11-17(13)21/h5-8,10-11,20-21H,9H2,1-4H3
charge 0 multiplicity 1
43 atoms
O  -1.064113 -1.631021 -1.746519
O  1.5624 -2.072945 -1.262761
N  -5.023941 0.86452 -0.529282
N  4.873508 1.348768 -0.019309
C  -0.015286 -1.639727 1.085367
C  -1.313277 -0.964805 0.634467
C  1.266235 -0.855607 0.797508
C  -1.767276 -0.993101 -0.718704
C  2.043099 -1.074162 -0.363013
C  -3.810294 0.272638 -0.145493
C  3.698945 0.633805 0.245911
C  -2.14275 -0.296892 1.566581
C  1.750602 0.145391 1.674002
C  -2.987289 -0.39412 -1.098852
C  3.226467 -0.36969 -0.655349
C  -3.360067 0.315215 1.212613
C  2.926352 0.877516 1.425909
C  -5.85851 1.535886 0.470125
C  -5.45704 0.803684 -1.927828
C  5.328878 2.381086 0.918736
C  5.637841 1.078064 -1.239787
H  -0.080433 -1.792361 2.178445
H  0.067635 -2.647625 0.634932
H  -1.825531 -0.265986 2.617649
H  1.179753 0.356174 2.58671
H  -3.266722 -0.466969 -2.152361
H  3.771545 -0.592494 -1.579429
H  -3.954731 0.80873 1.985581
H  3.242387 1.633939 2.148528
H  -6.180538 0.842874 1.275686
H  -6.764972 1.932515 -0.015167
H  -5.330274 2.386589 0.949786
H  -5.592039 -0.2421 -2.275036
H  -4.72714 1.29073 -2.607706
H  -6.421986 1.324686 -2.037428
H  4.578533 3.189186 1.040845
H  6.257255 2.836725 0.539225
H  5.542237 1.961229 1.923288
H  6.526163 1.728487 -1.269817
H  5.042149 1.276971 -2.155544
H  5.988966 0.025685 -1.283129
H  -0.125432 -1.887821 -1.492845
H  2.162188 -2.180269 -2.039236
