program: Gaussian 09
title: 000113252
version: EM64L-G09RevD.01
frameworkgroup: C1[X(C25H21N5O4S2)]
method: RPBEPBE
basis: SDD
operation: Freq
keyword: #p
keyword: freq=noraman
keyword: PBEPBE/SDD
title: #p freq=noraman PBEPBE/SDD
converged: YES YES NO NO
title: Mulliken charges:
elementType: S S O O O O N N N N N C C C C C C C C C C C C C C C C C C C C C C C C C H H H H H H H H H H H H H H H H H H H H H
charge: 0.916681 0.285122 -0.242049 -0.186770 -0.552935 -0.550824 -0.233694 -0.428226 0.044056 -0.024812 -0.054773 -0.444764 -0.336764 0.185748 0.187528 0.139077 0.089454 -0.346485 -0.347508 0.496219 -0.206339 -0.205778 -0.634306 0.454477 -0.351726 -0.116279 -0.088151 -0.348309 -0.271354 0.368251 -0.287445 -0.237165 -0.305513 -0.792977 -0.741857 -0.386058 0.259184 0.256265 0.233083 0.243156 0.365299 0.273253 0.273835 0.245294 0.245307 0.242826 0.244091 0.279034 0.302555 0.286885 0.269292 0.253725 0.210009 0.248612 0.291841 0.266320 0.266382
chargesum: 0.00000
title: Mulliken charges with hydrogens summed into heavy atoms:
elementType: S S O O O O N N N N N C C C C C C C C C C C C C C C C C C C C C C C C C
charge: 0.916681 0.285122 -0.242049 -0.186770 -0.552935 -0.550824 -0.233694 -0.062927 0.044056 -0.024812 -0.054773 0.070685 0.139475 0.185748 0.187528 0.139077 0.089454 -0.073232 -0.073673 0.496219 0.038955 0.039529 -0.391480 0.454477 -0.107635 -0.116279 -0.088151 -0.348309 0.007681 0.368251 0.015110 0.049720 -0.036221 -0.080631 0.082686 -0.386058
polarizability: 9.83284486e+02 -2.58029595e+01 3.56028259e+02 -1.35754862e+01 -2.15551527e+01 2.30157843e+02
1716.lowfreq: -0.0013 0.0012 0.0019 0.5151 2.4104 6.4262 7.3619 11.4700 18.0420
frequency: 7.2989 11.0715 18.0384 21.8890 32.0153 39.0011 42.9470 51.2896 79.1299 85.8317 91.1267 94.1980 111.4380 114.9890 139.0478 146.1156 155.1927 163.1943 169.1394 181.6663 191.3455 195.4762 196.7545 214.0215 232.2298 235.6230 241.1124 252.0216 252.6592 288.6815 303.3685 319.8967 328.5416 342.0109 354.4573 382.8094 391.9922 398.3057 404.5356 420.9107 423.1394 442.5577 455.2526 461.7341 480.6749 500.6833 516.9440 523.3885 534.6922 552.6486 574.9967 582.8130 584.8552 597.7377 612.0269 619.7716 636.8653 656.7171 678.0129 685.5166 690.4698 705.5079 717.6595 719.4726 744.7155 747.1609 752.7658 785.5324 786.0807 797.9101 818.2892 826.2190 834.7340 840.5177 873.6250 885.4709 886.0991 888.8384 899.0109 909.3338 912.2252 940.5784 968.7615 969.8882 977.7737 987.5225 997.0019 1005.2627 1007.1864 1010.1758 1019.5578 1027.9090 1032.0718 1042.3149 1046.3548 1064.2840 1073.2692 1100.8325 1120.4228 1128.4380 1159.2690 1170.9052 1173.2034 1183.8059 1204.6067 1228.4717 1237.0653 1240.7581 1272.0913 1284.4885 1286.2331 1297.2260 1301.9047 1312.1415 1335.7767 1347.0537 1360.3029 1362.0167 1379.9136 1380.2843 1395.0739 1400.7804 1407.4272 1418.6495 1419.1895 1421.2380 1440.4581 1447.5379 1452.7858 1454.4970 1454.7038 1456.8789 1480.2204 1487.8109 1500.8893 1529.7697 1548.5359 1562.5126 1590.7884 1614.9080 1616.9374 1622.2945 1631.3107 1676.5086 2953.9933 2995.2294 2997.2602 3018.9755 3029.3814 3081.6244 3085.9371 3097.1989 3125.6354 3144.8696 3147.4550 3152.5240 3154.1741 3157.1405 3167.9785 3168.6380 3178.2212 3178.8749 3179.1924 3183.3180 3392.2507
redmass: 7.1472 6.0507 7.4845 8.1889 5.4253 6.4118 6.7377 5.7720 5.8362 2.9070 1.9219 2.7230 5.6400 5.5279 4.9472 4.0612 1.1409 3.9711 8.4469 5.7106 5.0660 5.6550 5.5931 5.0873 4.7227 4.1038 5.8574 7.6335 6.7872 5.8040 3.5475 8.4723 3.6281 5.9316 5.7967 7.2141 7.2829 5.9766 3.4114 7.0769 4.2423 3.3187 4.7431 3.1586 5.9358 7.9064 4.0813 7.2221 5.7345 5.3555 4.6052 4.2417 7.9150 4.7047 6.6711 5.5376 7.6998 3.8263 4.2888 1.5537 4.9460 8.0276 6.8356 2.5269 4.2178 4.1356 3.3689 5.2949 12.1417 1.6640 3.5109 1.5285 5.6780 1.5281 1.5319 3.1581 3.3771 3.9354 1.4037 1.3932 7.6021 2.8876 1.3516 1.3284 1.4117 1.3528 2.1191 2.2498 1.8369 1.3556 5.4697 2.0823 2.3732 2.3545 1.5807 7.2904 2.6863 2.6502 1.6449 1.6370 2.3142 1.2024 1.9911 2.1495 2.7146 2.3892 1.1994 1.7488 1.5925 3.2521 1.4989 5.8926 1.1420 1.4980 5.1415 1.5597 3.2942 2.8778 1.9092 1.4725 4.3689 1.2341 1.0546 5.4150 4.8371 1.0599 1.8875 1.2673 1.0495 4.1204 2.4644 2.1711 1.1519 1.5593 3.1294 4.3872 7.1006 2.3261 7.6748 7.6027 7.3694 7.4198 6.4930 11.4443 1.0586 1.0363 1.0955 1.0689 1.0246 1.0963 1.1024 1.1010 1.0915 1.0868 1.0870 1.0894 1.0928 1.0908 1.0958 1.0964 1.1006 1.0974 1.1060 1.1078 1.0808
irintensity: 0.6003 1.8970 0.0733 0.1161 0.2178 3.5859 0.8385 2.8780 2.1801 6.3421 2.4089 1.8009 3.6344 1.3431 0.5879 1.8341 0.4305 3.5740 18.5578 2.3817 1.5337 1.3870 0.5135 1.9151 0.2521 2.6895 0.7970 5.3308 0.4534 4.8365 6.3805 17.4724 9.8353 25.2232 6.2116 27.6480 61.0389 11.4660 6.5939 0.1545 5.2218 15.6463 1.2594 7.3499 46.7065 4.4671 5.2845 12.5387 9.9133 9.7378 18.0340 81.3437 9.9244 53.4965 2.9034 18.9211 91.3306 10.9989 9.8610 96.0774 0.1907 9.4369 5.6501 128.4734 1.6931 4.8167 2.1820 0.0545 87.7227 25.8936 4.7294 21.4723 8.5071 34.0137 49.0952 36.6465 31.1605 15.8484 17.7452 0.0046 45.8025 31.4237 1.7999 157.5057 1.9980 1.0542 96.5415 29.3927 55.7258 0.0676 148.2122 2.1033 47.1973 223.1543 11.4826 36.7456 10.6815 9.6425 25.7744 17.3700 54.7698 12.5605 8.5680 116.5561 9.4380 71.6511 88.2525 211.6248 157.8939 176.1681 4.2744 1766.4467 5.3317 9.1516 370.4194 80.5313 6.4405 221.5749 8.1710 32.7496 35.8684 24.2175 9.3890 39.6874 67.2957 21.2315 33.0513 30.9712 13.7253 82.9630 10.9891 9.7145 72.2773 20.3103 18.1604 290.9248 6.1442 474.7581 4.1507 6.5317 234.8226 541.8762 635.1411 92.9157 80.4471 18.5377 11.6126 39.9075 1.2664 10.4112 1.4377 23.2588 24.7669 1.2608 13.4706 1.7428 9.4241 3.7581 3.5106 18.6783 20.4440 1.3764 2.3953 1.3415 1371.4436
temp: 298.150 k
press: 1.00000 atm
elementType: 16 16 8 8 8 8 7 7 7 7 7 6 6 6 6 6 6 6 6 6 6 6 6 6 6 6 6 6 6 6 6 6 6 6 6 6 1 1 1 1 1 1 1 1 1 1 1 1 1 1 1 1 1 1 1 1 1
symmnumber: 1
zpe: 1091608.8 jmol-1
zpe.correction: 0.415772 hartree
zpe.thermalcorrener: 0.449012 hartree
zpe.thermalcorrenthalpy: 0.449956 hartree
zpe.thermalcorrgfe: 0.345844 hartree
zpe.sumelectzpe: -2333.346439 hartree
zpe.sumelectthermal: -2333.313199 hartree
zpe.sumelectthermalent: -2333.312255 hartree
zpe.sumelectthermalfe: -2333.416367 hartree
dipole: 16.0336 0.6995 -3.9061
dipole: 16.5174
quadrupole: -204.4853 -217.5792 -227.1769
quadrupole: 24.1464 64.0838 7.8266
quadrupole: 11.9285 -1.1654 -10.7631 24.1464 64.0838 7.8266
hfenergy: -2333.7622109 hartree
pointgroup: C01 [X(C25H21N5O4S2)]
dipole: -6.2856571 0.3994545 -1.6002179 debye
polarizability: 981.3829309|-44.8343416|330.4204041|12.381042|55.6651859|257.6672534 unknown
InChI: InChI=1S/C25H21N5O4S2/c1-15-13-16(26-11-12-30-23(31)18-5-3-4-6-19(18)24(30)32)7-9-20(15)28-29-25-27-21-10-8-17(36(2,33)34)14-22(21)35-25/h3-10,13-14,26H,11-12H2,1-2H3
charge 0 multiplicity 1
57 atoms
S  10.468705 -0.601976 0.961525
S  5.078225 1.296521 1.01098
O  -5.984364 -0.535731 -1.613576
O  -7.710534 2.276506 1.742194
O  10.565449 0.370622 2.276031
O  11.072306 -2.123726 0.94593
N  -6.629035 1.118499 -0.035228
N  -3.633665 1.051605 -0.887189
N  4.600055 -0.894783 -0.523596
N  1.847126 -0.21064 -0.736956
N  2.646471 0.545725 0.013066
C  -5.787833 2.232746 -0.505107
C  -4.298857 2.11601 -0.125867
C  -7.752211 -0.916353 0.10308
C  -8.260571 -0.078727 1.127797
C  -6.701962 -0.16198 -0.644128
C  -7.560797 1.241304 1.052076
C  -8.224561 -2.224833 -0.075663
C  -9.258974 -0.522031 2.007004
C  -2.283415 0.779291 -0.815614
C  -9.236681 -2.682268 0.808662
C  -9.74516 -1.844754 1.833411
C  -1.746205 -0.31236 -1.573641
C  -0.383927 -0.633002 -1.546366
C  -1.395369 1.561844 -0.000712
C  8.645408 -0.696801 0.459814
C  0.499098 0.164967 -0.725484
C  6.439114 0.199712 0.57995
C  -0.037541 1.254529 0.03528
C  5.965002 -0.896828 -0.234293
C  7.794918 0.309962 0.941708
C  8.230421 -1.800952 -0.316661
C  6.872995 -1.898091 -0.669989
C  0.159538 -1.789319 -2.359178
C  11.317047 0.335988 -0.478696
C  3.976707 0.144225 0.019038
H  -5.891211 2.312174 -1.603251
H  -6.202314 3.145396 -0.043039
H  -3.82293 3.094276 -0.344209
H  -4.207356 1.9458 0.967098
H  -4.24101 0.427844 -1.438011
H  -7.82392 -2.863805 -0.868499
H  -9.644608 0.132021 2.795028
H  -9.631356 -3.697818 0.700158
H  -10.524832 -2.226512 2.500731
H  -2.427381 -0.910038 -2.191523
H  -1.782001 2.393883 0.595265
H  0.656937 1.835905 0.649921
H  8.185112 1.103204 1.587497
H  8.954297 -2.572229 -0.599123
H  6.494549 -2.732156 -1.267059
H  0.697626 -2.505819 -1.715236
H  -0.65143 -2.317084 -2.889422
H  0.899299 -1.436488 -3.099358
H  12.375515 0.395093 -0.189006
H  11.167074 -0.265483 -1.385567
H  10.84612 1.326533 -0.5390
