program: Gaussian 09
title: 000113246
version: EM64L-G09RevD.01
frameworkgroup: C1[X(C15H16N4O3)]
method: RPBEPBE
basis: SDD
operation: Freq
keyword: #p
keyword: freq=noraman
keyword: PBEPBE/SDD
title: #p freq=noraman PBEPBE/SDD
converged: YES YES NO NO
title: Mulliken charges:
elementType: O O O N N N N C C C C C C C C C C C C C C C H H H H H H H H H H H H H H H H
charge: -0.426239 -0.217784 -0.218401 -0.429592 -0.102063 -0.126116 0.020117 0.307956 0.343553 -0.370353 -0.330343 -0.525877 0.152662 -0.316446 -0.838180 -0.334327 0.175496 -0.266268 -0.321862 0.379896 -0.339174 -0.341693 0.315971 0.239837 0.223407 0.231174 0.256076 0.277721 0.223015 0.231795 0.252779 0.232994 0.185390 0.281537 0.258118 0.283496 0.286340 0.345390
chargesum: 0.00000
title: Mulliken charges with hydrogens summed into heavy atoms:
elementType: O O O N N N N C C C C C C C C C C C C C C C
charge: -0.080849 -0.217784 -0.218401 -0.113621 -0.102063 -0.126116 0.020117 0.307956 0.343553 0.092891 -0.099169 -0.269801 0.152662 -0.038725 -0.130592 0.084056 0.175496 0.015269 -0.063744 0.379896 -0.055679 -0.055354
polarizability: 6.71321515e+02 -1.18636584e+01 1.98910315e+02 1.83710813e+01 7.61671120e+00 9.70448924e+01
1716.lowfreq: -1.6868 -0.0008 -0.0005 0.0009 4.1518 9.2016 18.3842 24.1000 36.3911
frequency: 18.3161 24.0700 36.3796 42.4620 61.4917 69.7868 79.3950 119.1981 126.1759 169.9591 173.4873 176.1802 192.0282 195.8935 265.4014 266.6840 281.5200 312.5425 318.5871 367.6008 382.9227 394.7531 414.4798 433.8257 452.4635 472.1001 503.2340 510.3046 526.5410 550.8560 551.8638 590.1586 593.3870 624.8943 660.6888 667.4421 737.1952 742.2223 751.9164 781.4572 798.4613 826.0389 849.4434 852.9484 880.8717 881.4355 904.8645 915.1583 944.9517 981.0737 992.1818 993.6258 994.3258 1007.7215 1019.1426 1045.0570 1075.8259 1083.6083 1090.9389 1100.1775 1117.5439 1142.8902 1167.7278 1183.5534 1197.6484 1210.0866 1222.4356 1237.4332 1278.0572 1290.7453 1318.5412 1321.1138 1324.4184 1353.6614 1357.1622 1378.3540 1384.1751 1398.2494 1403.9422 1426.6727 1431.3445 1460.2993 1463.7540 1467.7875 1476.0860 1481.2272 1490.7209 1515.7621 1568.5255 1580.0551 1600.4891 1626.7690 2928.6002 2948.7542 2951.2789 3019.3734 3061.6833 3087.9773 3093.9011 3145.8405 3153.2722 3162.5077 3167.1495 3174.8987 3185.1049 3188.9395 3520.7583 3532.8237
redmass: 6.3893 5.3800 6.4364 5.9973 4.3544 7.2503 6.1615 4.3294 4.5528 4.1847 3.1291 3.0739 2.6540 1.9340 4.1888 4.1931 2.7355 2.7146 6.3668 2.2843 3.8781 2.4710 3.0250 2.8626 3.1166 5.9357 3.1608 5.4228 3.8928 1.5753 3.1877 3.0193 4.3498 7.0911 7.3015 4.6181 4.0860 7.3694 4.3615 4.8030 4.5290 1.4873 1.2470 2.7175 1.9898 3.4734 1.8283 1.4157 3.4965 1.3475 1.8039 2.3701 1.3426 1.3392 2.8822 1.5169 2.8745 1.8783 3.3230 1.2815 1.7546 1.6130 1.5520 1.3977 2.2357 4.1203 1.3951 2.3356 1.3560 1.5178 2.9940 1.3030 3.4010 7.2459 1.7011 3.0062 1.3182 1.2801 7.4682 3.5210 2.6900 1.2274 2.3944 1.4198 1.0489 1.3741 1.2848 3.2554 4.0375 7.9135 6.6294 6.6502 1.0716 1.0680 1.0417 1.0965 1.0926 1.0925 1.0948 1.0919 1.0870 1.0894 1.0880 1.0962 1.0962 1.0966 1.0752 1.0657
irintensity: 0.3402 1.0210 1.1223 0.4437 2.4661 0.1043 5.2188 0.7779 5.4085 3.2032 2.0326 19.4890 2.1296 12.8084 6.5739 5.9479 2.2153 12.8650 3.6024 71.0991 47.7939 35.2342 0.2955 78.4900 10.2939 5.7916 2.4430 3.4673 7.5612 174.8934 71.9608 48.8310 8.3151 0.0176 2.8779 27.5715 9.8673 7.9768 1.6859 7.6998 24.4323 21.8387 1.1050 30.3766 50.7753 18.2445 8.5516 27.6293 6.8619 2.5037 21.1066 4.1577 0.2831 0.0333 71.4746 6.9572 85.7138 4.4793 73.7811 33.7133 357.0075 199.8993 8.1502 65.6569 34.3376 1404.6657 18.6869 19.1916 5.0235 0.1178 706.1150 82.9142 83.6111 114.0489 65.6024 43.3775 26.5333 14.9559 9.4755 15.7863 17.7086 15.5052 1.6745 56.3353 18.2070 16.3160 7.6582 140.1747 254.2162 37.3460 197.1545 358.8501 66.0078 101.0836 69.1798 23.9254 17.2570 41.2410 8.0889 6.5265 12.0849 2.5090 1.2352 15.7352 0.4184 0.3916 95.8771 9.7550
temp: 298.150 k
press: 1.00000 atm
elementType: 8 8 8 7 7 7 7 6 6 6 6 6 6 6 6 6 6 6 6 6 6 6 1 1 1 1 1 1 1 1 1 1 1 1 1 1 1 1
symmnumber: 1
zpe: 766075.4 jmol-1
zpe.correction: 0.291783 hartree
zpe.thermalcorrener: 0.312419 hartree
zpe.thermalcorrenthalpy: 0.313364 hartree
zpe.thermalcorrgfe: 0.239679 hartree
zpe.sumelectzpe: -1024.158039 hartree
zpe.sumelectthermal: -1024.137402 hartree
zpe.sumelectthermalent: -1024.136458 hartree
zpe.sumelectthermalfe: -1024.210143 hartree
dipole: -11.2948 0.9163 -2.2576
dipole: 11.5546
quadrupole: -173.1542 -116.6925 -133.3320
quadrupole: -9.3980 15.0970 3.8125
quadrupole: -32.0947 24.3671 7.7276 -9.3980 15.0970 3.8125
hfenergy: -1024.4498215 hartree
pointgroup: C01 [X(C15H16N4O3)]
dipole: 4.4377036 -0.8581782 -0.4855829 debye
polarizability: 671.0689785|-21.2610836|145.2441665|-13.8000396|-51.1063741|150.9635772 unknown
InChI: InChI=1S/C15H16N4O3/c1-11-10-13(4-7-15(11)16-8-9-20)18-17-12-2-5-14(6-3-12)19(21)22/h2-7,10,16,20H,8-9H2,1H3
charge 0 multiplicity 1
38 atoms
O  7.469093 1.642018 0.448856
O  -7.230034 -0.686711 1.069801
O  -7.457271 0.880136 -0.575365
N  5.285826 -0.258771 -0.306729
N  -0.336038 -0.421464 0.22679
N  -1.08065 0.360086 -0.531237
N  -6.737595 0.114143 0.180014
C  3.893569 -0.281419 -0.225281
C  3.267787 -1.160025 0.731347
C  6.076799 0.515495 -1.278863
C  3.078074 0.556575 -1.053015
C  1.86969 -1.156823 0.826651
C  1.055729 -0.31585 0.012575
C  1.685915 0.544707 -0.935639
C  4.113811 -2.054908 1.617968
C  7.488404 0.757333 -0.716819
C  -2.481866 0.232445 -0.287676
C  -3.070834 -0.636843 0.680424
C  -3.315295 1.057153 -1.094653
C  -5.270353 0.155669 0.0174
C  -4.463296 -0.676065 0.833805
C  -4.711735 1.024598 -0.948382
H  5.781845 -1.026917 0.152393
H  5.596399 1.496195 -1.437742
H  6.137832 0.000666 -2.262446
H  3.543905 1.208841 -1.797263
H  1.362618 -1.809581 1.545926
H  1.057827 1.181546 -1.565554
H  4.725307 -2.771566 1.031094
H  4.806118 -1.469556 2.256153
H  3.477099 -2.65364 2.288768
H  8.109461 1.271153 -1.467993
H  7.975226 -0.214813 -0.472626
H  -2.412878 -1.26194 1.290243
H  -2.836276 1.713526 -1.827523
H  -4.945843 -1.329863 1.565225
H  -5.373069 1.647774 -1.555371
H  6.743599 1.340699 1.055844
