program: Gaussian 09
title: 000113200
version: EM64L-G09RevD.01
frameworkgroup: C1[X(C18H18O4)]
method: RPBEPBE
basis: SDD
operation: Freq
keyword: #pfreq=noraman
keyword: PBEPBE/SDD
title: #p freq=noraman PBEPBE/SDD
converged: YES YES NO NO
title: Mulliken charges:
elementType: O O O O C C C C C C C C C C C C C C C C C C H H H H H H H H H H H H H H H H H H
charge: -0.309263 -0.309256 -0.208190 -0.208191 -0.589898 -0.589987 0.532125 0.532290 -0.389848 -0.389838 -0.389887 -0.389874 -0.352679 -0.352684 -0.352640 -0.352629 0.405740 0.405697 0.232957 0.232960 -0.739863 -0.739866 0.227736 0.227730 0.227767 0.227746 0.235007 0.234962 0.235010 0.234960 0.242881 0.242889 0.242912 0.242913 0.251175 0.247738 0.251243 0.251180 0.247738 0.251237
chargesum: 0.00000
title: Mulliken charges with hydrogens summed into heavy atoms:
elementType: O O O O C C C C C C C C C C C C C C C C C C
charge: -0.309263 -0.309256 -0.208190 -0.208191 -0.134432 -0.134474 0.532125 0.532290 -0.154841 -0.154876 -0.154877 -0.154914 -0.109798 -0.109795 -0.109729 -0.109715 0.405740 0.405697 0.232957 0.232960 0.010293 0.010289
polarizability: 3.24762437e+02 1.68208056e-02 1.76490406e+02 -6.97601416e+00 1.04663342e-01 1.30144207e+02
1716.lowfreq: -42.8405 -40.6974 -28.5093 -27.4098 -6.3164 -1.6247 -0.0002 0.0009 0.0013
frequency: -42.7624 -40.6974 -27.4967 -26.4224 10.5496 19.6451 20.0365 32.0160 40.8305 81.6954 83.7677 93.3261 122.0922 161.9721 214.8745 278.9904 300.1727 306.3010 326.9522 371.0602 388.5540 402.5368 407.1139 409.7629 416.8453 478.1356 478.9551 527.6138 532.6415 555.5541 555.5706 616.1787 632.5933 634.5032 646.8382 689.9730 698.2615 744.4935 760.0691 783.6439 796.3415 807.0947 831.1614 831.3754 842.8261 863.0329 870.5110 874.5457 949.0314 952.9921 965.8471 966.1052 986.4282 987.6877 988.3075 999.7028 1007.4099 1008.9479 1039.6749 1039.6935 1088.9248 1111.9384 1144.3443 1151.1550 1153.9271 1171.2109 1171.5455 1192.2233 1192.7139 1214.9332 1217.3297 1267.3299 1272.7751 1298.3686 1302.1006 1322.2008 1380.7737 1382.8430 1382.9422 1383.0234 1405.8582 1406.9841 1452.5599 1452.5647 1453.0781 1453.0830 1472.5373 1486.8341 1492.9475 1493.1928 1596.3570 1596.6842 1613.4463 1613.7128 1680.1015 1680.2352 2989.7439 2998.7124 3010.5176 3010.5257 3038.0250 3064.9038 3097.9688 3097.9832 3124.1545 3124.7328 3126.7917 3127.2315 3147.3318 3147.3402 3163.0543 3163.1048 3166.6550 3166.7583
redmass: 4.5241 4.1150 1.2187 1.1887 5.2572 4.1841 5.4382 3.1387 6.7762 2.6495 2.8956 6.2963 5.9696 7.8019 5.8188 2.4403 3.5128 3.7509 3.7087 5.4221 5.4224 3.8958 2.9667 3.0396 3.4493 4.6446 3.4672 2.8937 4.3773 3.1854 3.1856 4.5224 6.9038 6.8296 3.7695 4.2577 4.0748 4.0096 4.3212 1.1958 4.3951 2.2969 1.2478 1.2471 2.2159 5.2532 4.1109 2.9845 1.4751 1.3765 1.3718 1.3738 1.6571 2.0203 2.0046 4.2978 2.9174 2.8936 1.6507 1.6508 1.3536 1.2712 1.1050 2.5855 2.5391 1.7003 1.7409 1.9744 1.9720 2.9402 2.8672 1.2342 1.4344 1.2855 1.2710 1.3865 6.1445 6.9111 1.2374 1.2390 2.9626 2.9156 1.0474 1.0474 1.0569 1.0568 1.1222 1.1014 2.6748 2.5541 7.4455 7.4367 6.5261 6.5690 10.1645 10.1763 1.0592 1.0598 1.0368 1.0368 1.1013 1.1049 1.0972 1.0972 1.0896 1.0896 1.0894 1.0894 1.1012 1.1012 1.0952 1.0952 1.0961 1.0961
irintensity: 0.0002 1.6534 2.6614 0.1238 0.1438 0.1740 0.6357 0.0000 0.0002 0.0001 6.4481 5.5912 0.0000 0.0000 3.3909 0.0001 4.1193 0.0000 1.2834 0.0000 1.2949 0.0001 0.7737 0.0001 3.2244 10.6462 0.0002 61.8791 0.0006 0.0203 5.4519 36.3298 0.0000 0.0426 0.0000 0.0000 0.7158 1.7805 0.0000 0.2482 5.6078 0.0001 0.0706 0.0013 79.9191 0.0000 197.9547 0.0027 0.0004 1.9746 0.0268 0.0013 0.0043 215.4740 0.0089 0.0001 47.0413 0.0074 16.8223 0.1195 15.3215 0.0000 13.7287 762.4542 0.0103 432.1073 1.7163 25.7721 0.1396 0.0653 8.4303 0.0000 8.7204 0.9985 0.0001 0.0002 0.0006 0.1633 128.7787 0.1137 4.1219 0.0287 8.3138 28.7268 3.3316 52.5639 0.0009 9.5368 190.1747 2.8190 3.1403 0.2009 2.4978 10.9086 0.4410 348.0581 0.0208 59.4646 2.0964 1.8151 0.0019 23.9391 5.8007 7.1639 2.8910 19.8536 31.5003 9.0955 17.3604 4.6520 2.7917 19.3788 6.6521 0.0577
temp: 298.150 k
press: 1.00000 atm
elementType: 8 8 8 8 6 6 6 6 6 6 6 6 6 6 6 6 6 6 6 6 6 6 1 1 1 1 1 1 1 1 1 1 1 1 1 1 1 1 1 1
symmnumber: 1
zpe: 821542.3 jmol-1
zpe.correction: 0.312909 hartree
zpe.thermalcorrener: 0.331572 hartree
zpe.thermalcorrenthalpy: 0.332516 hartree
zpe.thermalcorrgfe: 0.260879 hartree
zpe.sumelectzpe: -996.035931 hartree
zpe.sumelectthermal: -996.017268 hartree
zpe.sumelectthermalent: -996.016324 hartree
zpe.sumelectthermalfe: -996.087961 hartree
dipole: -0.0020 -0.0092 0.0004
dipole: 0.0094
quadrupole: -96.9218 -113.3241 -146.1638
quadrupole: -0.0365 14.8027 0.0789
quadrupole: 21.8815 5.4791 -27.3606 -0.0365 14.8027 0.0789
hfenergy: -996.3488396 hartree
pointgroup: C01 [X(C18H18O4)]
dipole: 0.0007805 0.0001746 -0.0036268 debye
polarizability: 324.3992119|10.9189259|130.507411|0.0214838|-0.0994605|176.4904272 unknown
InChI: InChI=1S/C18H18O4/c1-13(19)21-17-9-5-15(6-10-17)3-4-16-7-11-18(12-8-16)22-14(2)20/h5-12H,3-4H2,1-2H3
charge 0 multiplicity 1
40 atoms
O  6.085641 -0.559389 -0.000913
O  -6.085735 0.559994 0.001235
O  6.199553 1.78704 0.004058
O  -6.201239 -1.786364 -0.002833
C  0.30474 -0.723091 0.000497
C  -0.304729 0.719844 0.003509
C  1.824733 -0.699011 0.000174
C  -1.824453 0.696665 0.002979
C  2.550852 -0.661155 -1.218249
C  -2.550823 0.664395 -1.215534
C  2.551638 -0.666487 1.218298
C  -2.551661 0.659565 1.220876
C  3.960389 -0.587184 -1.228047
C  -3.960336 0.591472 -1.225702
C  3.961182 -0.592544 1.227528
C  -3.961182 0.586632 1.229816
C  4.648159 -0.551422 -0.0004
C  -4.648227 0.551042 0.001743
C  6.775471 0.684786 0.001911
C  -6.776401 -0.683713 -0.000847
C  8.264809 0.424394 -0.003239
C  -8.265565 -0.4223 -0.004817
H  -0.075726 -1.260001 -0.888709
H  -0.075304 -1.2637 0.88765
H  0.07639 1.260342 -0.883292
H  0.075763 1.256539 0.892891
H  2.0078 -0.69588 -2.170506
H  -2.007671 0.702854 -2.167639
H  2.009186 -0.705359 2.170735
H  -2.009127 0.694187 2.173482
H  4.522343 -0.562552 -2.166843
H  -4.522157 0.571192 -2.164671
H  4.523757 -0.571953 2.166046
H  -4.523647 0.562615 2.16831
H  8.546546 -0.176258 0.878714
H  8.809943 1.378579 0.003573
H  8.542816 -0.160528 -0.89699
H  -8.546828 0.175006 0.879559
H  -8.811342 -1.376136 -0.001762
H  -8.543257 0.166383 -0.896192
