program: Gaussian 09
title: 000113181
version: EM64L-G09RevD.01
frameworkgroup: C1[X(C12H13N3O2S)]
method: RPBEPBE
basis: SDD
operation: Freq
keyword: #p
keyword: freq=noraman
keyword: PBEPBE/SDD
title: #p freq=noraman PBEPBE/SDD
converged: YES YES NO NO
title: Mulliken charges:
elementType: S O O N N N C C C C C C C C C C C C H H H H H H H H H H H H H
charge: 0.156616 -0.203065 -0.206861 -0.214224 -0.603426 -0.321894 -0.367352 -0.324433 0.201892 0.202685 0.069947 0.105043 -0.683990 -0.361311 -0.369894 -0.214059 -0.213548 -0.080311 0.234477 0.242095 0.272356 0.215553 0.318300 0.259708 0.268881 0.268769 0.236651 0.235902 0.318801 0.328965 0.227728
chargesum: 0.00000
title: Mulliken charges with hydrogens summed into heavy atoms:
elementType: S O O N N N C C C C C C C C C C C C
charge: 0.156616 -0.203065 -0.206861 -0.214224 0.044340 -0.094167 0.109220 0.163476 0.201892 0.202685 0.069947 0.105043 -0.105982 -0.092430 -0.101125 0.022592 0.022354 -0.080311
polarizability: 1.90674222e+02 -3.43121873e+01 1.69144663e+02 1.47295905e+01 1.55067682e+01 1.49277797e+02
1716.lowfreq: -9.2699 -0.0005 0.0007 0.0015 4.2566 7.0474 11.8841 21.3378 42.1557
frequency: 11.6469 21.1689 42.1478 47.7414 53.3965 100.5525 139.1298 152.2876 175.4111 214.6206 234.2117 247.3197 263.2241 289.6212 328.1859 339.9056 375.2685 405.2556 410.4261 434.4107 455.5567 458.8368 518.6498 526.3248 558.8684 585.0594 587.5149 658.2482 674.0622 684.2913 696.2896 710.8181 723.5164 735.6506 785.5326 795.1291 826.7159 879.8125 900.7866 905.3709 972.5687 986.7192 996.4307 1004.0898 1004.3984 1021.1618 1043.1419 1061.5366 1072.7799 1112.3904 1166.2188 1171.5979 1190.7131 1207.4267 1255.4129 1281.0279 1283.2232 1295.7646 1309.3693 1337.1455 1348.5472 1361.4437 1414.8000 1416.7274 1447.6820 1453.5966 1456.4020 1459.0486 1612.8825 1616.4958 1619.6521 1626.9534 1640.8318 1676.7662 3007.6036 3016.5711 3037.3507 3071.3535 3084.2149 3118.8862 3136.8116 3151.0337 3162.9059 3172.8784 3370.8942 3527.6068 3675.6790
redmass: 5.6371 6.1503 5.9188 5.7444 5.4869 3.9553 5.0938 3.9001 7.1172 4.1382 3.9871 3.3100 3.5883 2.8957 10.0159 1.0635 3.7969 1.3987 2.6220 4.5552 4.9408 6.8010 4.2076 5.7490 3.1320 3.9752 4.2172 4.7795 4.8513 4.0283 5.2786 2.5803 1.4341 1.5983 5.2232 1.6890 3.5250 3.6117 2.8116 1.3938 1.4139 1.7685 3.2929 1.8731 1.7500 1.9988 1.6033 2.0807 2.5874 2.3889 1.2189 2.0132 1.4721 2.4133 1.2798 2.2275 1.6810 1.2479 1.3734 2.2309 1.3037 1.8975 1.5203 2.4201 1.2117 2.4768 1.5496 1.4213 1.4751 7.6103 7.1249 8.3245 3.2162 11.7250 1.0610 1.0602 1.0586 1.1022 1.1030 1.1061 1.0862 1.0905 1.0955 1.1003 1.0769 1.0448 1.1043
irintensity: 0.3420 2.1190 2.8035 6.0657 1.5858 2.8078 0.1329 4.0164 2.3253 3.0301 1.5826 6.8458 2.4631 4.2456 16.5051 17.6769 2.8864 247.5932 32.7293 6.5976 0.0467 0.6243 5.0625 5.5486 15.3219 17.5714 37.1781 0.0847 1.6664 15.3455 24.2495 57.7636 66.6029 25.4245 0.0806 25.7845 3.3166 18.4530 11.6767 0.0651 3.1730 120.5386 13.3339 20.8182 17.1195 1.0272 13.9251 6.1159 11.7113 16.0619 6.6025 5.0285 7.4481 10.7158 22.5845 140.5341 40.4041 10.5933 29.9100 176.7730 4.5634 102.2133 8.3932 18.2438 30.8739 10.9425 7.3809 12.0885 52.9159 2.2988 210.2993 266.2676 287.5189 52.5778 11.4184 43.9143 13.1026 13.7023 7.0405 5.0684 1.9664 6.6603 7.4302 21.9766 17.3877 37.9535 22.1764
temp: 298.150 k
press: 1.00000 atm
elementType: 16 8 8 7 7 7 6 6 6 6 6 6 6 6 6 6 6 6 1 1 1 1 1 1 1 1 1 1 1 1 1
symmnumber: 1
zpe: 618539.3 jmol-1
zpe.correction: 0.235589 hartree
zpe.thermalcorrener: 0.253000 hartree
zpe.thermalcorrenthalpy: 0.253945 hartree
zpe.thermalcorrgfe: 0.187312 hartree
zpe.sumelectzpe: -1176.560692 hartree
zpe.sumelectthermal: -1176.543281 hartree
zpe.sumelectthermalent: -1176.542337 hartree
zpe.sumelectthermalfe: -1176.608969 hartree
dipole: -0.4639 4.1955 0.2335
dipole: 4.2275
quadrupole: -94.7465 -93.4369 -123.8000
quadrupole: -0.9462 4.7731 -2.0464
quadrupole: 9.2480 10.5575 -19.8055 -0.9462 4.7731 -2.0464
hfenergy: -1176.7962811 hartree
pointgroup: C01 [X(C12H13N3O2S1)]
dipole: -0.0724055 -1.1927393 1.1569318 debye
polarizability: 176.005136|-40.7609579|159.1321396|9.3652007|-15.1473476|173.9594067 unknown
InChI: InChI=1S/C12H13N3O2S/c13-12(14)18-7-3-6-15-10(16)8-4-1-2-5-9(8)11(15)17/h1-2,4-5,13H,3,6-7,14H2
charge 0 multiplicity 1
31 atoms
S  -4.159155 0.158273 -0.54694
O  0.667275 0.249757 -2.746007
O  0.491212 1.859095 1.676352
N  0.368787 1.312567 -0.636357
N  -4.334049 -1.385612 1.645407
N  -2.073601 -1.002713 0.822424
C  -0.568925 2.369924 -1.046082
C  -2.024407 2.051269 -0.616726
C  1.717841 -0.585936 -0.645574
C  1.658512 -0.107413 0.685117
C  0.886339 0.313412 -1.509729
C  0.791631 1.115136 0.709791
C  -2.588555 0.82596 -1.354124
C  2.463222 -1.724969 -0.982079
C  2.346992 -0.749723 1.724219
C  3.16072 -2.385861 0.062978
C  3.103996 -1.905133 1.395824
C  -3.369456 -0.860571 0.790622
H  -0.483603 2.467767 -2.143321
H  -0.24592 3.315516 -0.575339
H  -2.032474 1.865961 0.471078
H  -2.652156 2.94231 -0.806842
H  -1.880409 -0.01648 -1.323654
H  -2.868528 1.041555 -2.398728
H  2.500031 -2.085408 -2.014822
H  2.2987 -0.36699 2.7486
H  3.753255 -3.279491 -0.161051
H  3.654846 -2.433933 2.181309
H  -4.061928 -1.992297 2.416187
H  -5.321272 -1.165145 1.525397
H  -1.70442 -1.581627 1.59927
