program: Gaussian 09
title: 000113167
version: EM64L-G09RevD.01
frameworkgroup: C1[X(C38H16Cl2N2O2)]
method: RPBEPBE
basis: SDD
operation: Freq
keyword: #p
keyword: freq=noraman
keyword: PBEPBE/SDD
title: #p freq=noraman PBEPBE/SDD
converged: NO NO NO NO
title: Mulliken charges:
elementType: Cl Cl O O N N C C C C C C C C C C C C C C C C C C C C C C C C C C C C C C C C C C C C C C H H H H H H H H H H H H H H H H
charge: 0.031300 0.031301 -0.243193 -0.243195 0.048736 0.048735 0.016497 0.016496 0.019460 0.019457 0.357116 0.357121 0.552107 0.552110 -0.200336 -0.200345 0.480296 0.480299 0.473879 0.473879 0.279619 0.279617 -0.706164 -0.706167 -0.475209 -0.475212 0.166774 0.166777 0.539531 0.539529 -0.500483 -0.500482 -0.468153 -0.468152 -0.481602 -0.481603 -0.753385 -0.753387 -0.458969 -0.458970 -0.458886 -0.458887 -0.241642 -0.241639 0.274840 0.274840 0.292946 0.292947 0.249945 0.249946 0.242458 0.242456 0.241322 0.241323 0.246461 0.246461 0.244392 0.244393 0.230349 0.230349
chargesum: 0.00000
title: Mulliken charges with hydrogens summed into heavy atoms:
elementType: Cl Cl O O N N C C C C C C C C C C C C C C C C C C C C C C C C C C C C C C C C C C C C C C
charge: 0.031300 0.031301 -0.243193 -0.243195 0.048736 0.048735 0.016497 0.016496 0.019460 0.019457 0.357116 0.357121 0.552107 0.552110 -0.200336 -0.200345 0.480296 0.480299 0.473879 0.473879 0.279619 0.279617 -0.431325 -0.431328 -0.182263 -0.182265 0.166774 0.166777 0.539531 0.539529 -0.250537 -0.250536 -0.225696 -0.225696 -0.240281 -0.240280 -0.753385 -0.753387 -0.212508 -0.212508 -0.214494 -0.214495 -0.011293 -0.011290
polarizability: 2.10560911e+03 2.43230779e+01 5.01761434e+02 -1.03335545e-01 1.28957664e-02 1.57573746e+02
1716.lowfreq: -2.4244 -0.0019 -0.0012 0.0018 3.8430 11.7131 14.8668 30.1674 39.6967
frequency: 14.8668 30.1674 39.6773 46.3175 46.8513 62.2403 93.4549 94.9674 105.1955 137.5579 145.9190 152.9136 161.7444 181.4081 185.2951 196.4002 197.2341 203.4886 213.3439 223.5002 228.9986 255.3399 295.4472 306.4193 329.8563 332.3730 354.0669 363.2358 372.5502 377.5450 380.8711 410.9480 433.0676 441.7617 450.8430 456.3096 460.3161 463.7736 472.3170 490.6699 491.8781 510.1540 511.5554 511.6477 516.5714 533.1552 534.7230 535.0131 552.9827 553.6566 567.0058 574.9455 578.0713 592.0638 593.3524 602.4798 621.3934 635.7219 637.5874 654.5456 687.3271 697.0558 704.6630 706.3724 731.5821 750.2581 752.5327 756.2100 756.4212 774.1625 774.4824 802.4332 805.9454 825.0916 827.5489 828.6410 828.7094 833.9565 853.3761 853.7125 855.6692 859.6695 873.8068 873.8637 901.4632 904.1731 904.2101 924.3346 924.3640 961.3636 977.3334 981.2369 981.2584 981.3873 991.1336 991.1400 1003.9587 1011.2721 1011.2782 1024.6350 1064.4450 1074.3285 1098.1735 1116.5891 1121.0164 1124.8611 1147.3654 1157.1784 1169.3394 1171.4094 1172.3930 1186.6669 1193.7967 1194.1722 1230.4247 1231.2742 1239.7094 1241.7214 1253.7172 1253.7240 1273.1604 1276.3400 1296.5047 1327.4834 1329.5286 1353.4366 1361.5296 1381.3022 1384.2129 1385.1146 1412.3099 1413.3787 1416.1106 1416.8426 1427.7793 1428.2515 1429.4386 1439.9854 1446.6906 1461.1436 1463.7150 1473.4817 1480.8579 1484.6698 1492.5058 1494.3829 1526.4627 1536.5486 1546.3691 1581.9629 1585.6846 1586.6433 1597.9506 1598.0798 1610.5433 1627.9652 1628.4725 1635.0721 3123.2112 3123.2228 3124.4856 3124.4925 3130.8375 3130.8553 3133.3784 3133.3800 3147.5530 3147.5971 3157.8888 3157.9732 3159.1626 3159.1999 3172.3074 3172.3323
redmass: 8.6100 5.2522 9.0778 7.3653 7.5483 9.7124 9.6202 9.3073 7.1955 6.2711 10.2538 5.8739 21.3704 8.9299 5.6776 6.6017 8.8595 6.1165 4.9698 4.4785 4.4607 6.2828 5.7163 28.9446 9.7009 5.7467 7.3816 7.0266 5.1974 7.3259 5.8092 8.5380 6.5774 4.2894 6.7962 8.3986 6.0624 5.0956 6.0223 6.1149 6.2063 3.7990 6.9554 3.8787 7.3738 4.0169 9.4164 3.9528 3.1036 3.0887 7.0193 6.7547 10.5558 8.0527 10.5440 10.6506 8.4705 7.8898 6.1756 4.8331 6.4718 7.7004 3.7402 3.8292 6.6507 6.6742 3.0065 5.7919 3.0659 1.3021 1.3196 5.8223 5.2584 9.3135 6.4503 1.5218 1.5584 7.8303 2.9296 2.9503 8.3232 8.1039 1.6836 1.6840 8.7527 1.8140 1.8060 1.4954 1.4958 8.7855 5.6317 1.3665 1.3666 5.1295 1.4034 1.4034 7.7402 1.3569 1.3568 8.5357 3.0247 2.2045 2.5372 2.6658 2.4404 2.0518 1.5380 1.4345 2.3966 1.2499 1.2443 5.9647 1.3026 1.2902 2.0800 1.9370 2.2508 2.2707 1.8220 1.7961 4.7002 4.7835 8.9911 3.5416 3.3910 5.7871 4.2131 2.9620 4.0177 4.8814 3.1379 3.4323 2.5543 2.4986 4.2828 3.4707 9.8362 5.9729 6.5392 6.8922 6.6431 8.3173 6.4120 7.6036 3.6583 3.7822 7.1251 5.6965 7.8553 8.6253 6.1403 6.0253 6.7553 6.7199 7.6853 7.5247 7.4551 9.6785 1.0866 1.0866 1.0862 1.0862 1.0899 1.0899 1.0914 1.0914 1.0980 1.0980 1.0989 1.0989 1.0923 1.0924 1.0953 1.0954
irintensity: 0.5294 0.1564 0.0000 0.0001 0.5608 0.0663 0.0000 0.0417 0.0000 0.8725 0.0000 0.0000 0.1243 0.0000 3.2703 0.0000 3.8243 0.0160 0.0000 17.4174 0.0000 1.7845 0.0000 0.0000 1.1941 1.0150 0.0000 0.0000 3.6111 7.9209 0.0001 0.0000 0.0000 2.0626 0.0000 9.0428 0.0000 1.4474 0.0000 0.0000 27.4274 0.3107 6.4521 0.0008 0.0000 0.2861 54.6240 0.0007 0.2624 0.0000 0.0000 21.0258 0.0000 0.0000 18.3769 11.0981 0.0000 1.0902 5.8108 0.0000 0.2755 0.0000 0.0000 21.6958 26.6004 14.8457 0.0000 0.0040 74.6320 0.0001 8.3429 24.9713 0.0000 0.0013 36.2763 0.9933 0.0005 0.0000 6.8190 0.0002 68.0076 0.0000 60.1641 0.0002 0.0000 0.0000 213.7983 3.1001 0.0044 19.4913 0.0000 0.0198 7.2084 28.8907 1.3020 0.0417 0.0000 0.0003 0.1207 158.9615 0.0000 26.6574 0.0000 4.1453 0.0000 4.3364 0.0000 4.2476 0.0000 18.2025 0.0000 57.5919 45.6761 0.0000 0.0000 59.1188 0.0000 16.4421 0.1176 51.0202 0.0000 176.2797 25.9456 0.0000 2.2635 0.0000 0.0000 150.6948 0.0000 21.6710 25.3945 0.0000 0.0000 133.0089 6.5052 0.0000 0.0000 9.2869 0.0000 69.9560 0.0000 35.4181 0.0000 40.6046 0.0000 187.1553 236.7666 0.0000 274.0858 0.0000 21.4363 0.0000 10.1286 0.0015 208.7877 0.0010 131.7328 0.0000 0.1843 0.0712 0.6037 0.3227 4.9908 3.3539 3.0017 33.9961 79.0153 2.1181 187.6534 0.1948 14.7154 0.0531 19.3811 3.3243
temp: 298.150 k
press: 1.00000 atm
elementType: 17 17 8 8 7 7 6 6 6 6 6 6 6 6 6 6 6 6 6 6 6 6 6 6 6 6 6 6 6 6 6 6 6 6 6 6 6 6 6 6 6 6 6 6 1 1 1 1 1 1 1 1 1 1 1 1 1 1 1 1
symmnumber: 1
zpe: 1108686.4 jmol-1
zpe.correction: 0.422276 hartree
zpe.thermalcorrener: 0.452537 hartree
zpe.thermalcorrenthalpy: 0.453481 hartree
zpe.thermalcorrgfe: 0.361661 hartree
zpe.sumelectzpe: -2634.947651 hartree
zpe.sumelectthermal: -2634.917390 hartree
zpe.sumelectthermalent: -2634.916446 hartree
zpe.sumelectthermalfe: -2635.008266 hartree
dipole: 0.0000 0.0000 0.0009
dipole: 0.0009
quadrupole: -168.0314 -242.5965 -273.3871
quadrupole: -7.7703 -0.0105 0.0012
quadrupole: 59.9736 -14.5915 -45.3821 -7.7703 -0.0105 0.0012
hfenergy: -2635.3699274 hartree
pointgroup: C01 [X(C38H16Cl2N2O2)]
dipole: -0.0000046 -0.0000014 0.0003731 debye
polarizability: 2105.3962463|30.5445053|501.9742968|-0.1033848|0.0124948|157.5737456 unknown
InChI: InChI=1S/C38H16Cl2N2O2/c39-31-35-37(43-25-15-21-9-7-17-3-1-5-19-11-13-23(33(25)41-35)29(21)27(17)19)32(40)36-38(31)44-26-16-22-10-8-18-4-2-6-20-12-14-24(34(26)42-36)30(22)28(18)20/h1-16H
charge 0 multiplicity 1
60 atoms
Cl 0.485996 3.193336 0.001381
Cl -0.48598 -3.193331 0.000657
O  -2.148436 1.802595 0.000369
O  2.148453 -1.802594 0.000992
N  2.61541 1.026746 0.001471
N  -2.615394 -1.026744 0.00094
C  6.117628 -0.330413 0.001107
C  -6.11761 0.330416 0.001539
C  7.472638 0.146398 0.001217
C  -7.47262 -0.146395 0.001962
C  5.028725 0.611688 0.001327
C  -5.028707 -0.611686 0.001407
C  5.853397 -1.754786 0.000787
C  -5.853377 1.754786 0.001261
C  3.675571 0.124896 0.00124
C  -3.675553 -0.124894 0.000968
C  7.739405 1.564941 0.001535
C  -7.739389 -1.564938 0.002275
C  8.57107 -0.790438 0.001003
C  -8.571052 0.790443 0.002102
C  -3.466685 1.291936 0.000786
C  3.466705 -1.291931 0.000959
C  4.508814 -2.218437 0.00071
C  -4.508796 2.218438 0.000877
C  5.312756 2.024148 0.001631
C  -5.312742 -2.024144 0.001728
C  1.361434 0.535397 0.001522
C  -1.361414 -0.535395 0.00101
C  -1.072431 0.904827 0.000905
C  1.072449 -0.904824 0.001116
C  6.970288 -2.670054 0.000556
C  -6.970271 2.670056 0.001391
C  6.621448 2.481041 0.001735
C  -6.621433 -2.481036 0.002128
C  8.27594 -2.206895 0.000665
C  -8.27592 2.2069 0.001782
C  0.214585 1.413197 0.001202
C  -0.214566 -1.413195 0.000922
C  9.090029 2.015603 0.001642
C  -9.090015 -2.015599 0.002699
C  9.9040 -0.296194 0.001111
C  -9.903984 0.2962 0.002526
C  10.157389 1.093431 0.001429
C  -10.15737 -1.093425 0.002822
H  4.281057 -3.288529 0.000491
H  -4.281051 3.288532 0.000686
H  4.462978 2.712148 0.00179
H  -4.462971 -2.712149 0.001594
H  6.764074 -3.746364 0.000313
H  -6.764052 3.746363 0.001162
H  6.827645 3.557934 0.001989
H  -6.827628 -3.557932 0.002349
H  9.113315 -2.914726 0.000486
H  -9.113298 2.914726 0.00188
H  9.292656 3.093012 0.001895
H  -9.292641 -3.093008 0.002931
H  10.73828 -1.007608 0.000937
H  -10.738264 1.007613 0.002624
H  11.190596 1.457215 0.001519
H  -11.190579 -1.457201 0.003161
