program: Gaussian 09
title: 000113163
version: EM64L-G09RevD.01
frameworkgroup: C1[X(C16H12N4O6S2)]
method: RPBEPBE
basis: SDD
operation: Freq
keyword: #p
keyword: freq=noraman
keyword: PBEPBE/SDD
title: #p freq=noraman PBEPBE/SDD
converged: YES YES NO NO
title: Mulliken charges:
elementType: S S O O O O O O N N N N C C C C C C C C C C C C C C C C H H H H H H H H H H H H
charge: 0.967304 0.989903 -0.557447 -0.562473 -0.487917 -0.490600 -0.492232 -0.488393 -0.223946 -0.063705 -0.064977 -0.686580 0.409620 0.575001 -0.164219 -0.265208 -0.405805 0.012126 -0.078904 -0.290883 -0.388192 -0.330206 0.418990 -0.345433 -0.348370 -0.392184 -0.391548 0.527609 0.317672 0.335540 0.283923 0.260100 0.280999 0.281700 0.385986 0.227927 0.226813 0.386519 0.316039 0.315448
chargesum: 0.00000
title: Mulliken charges with hydrogens summed into heavy atoms:
elementType: S S O O O O O O N N N N C C C C C C C C C C C C C C C C
charge: 0.967304 0.989903 -0.171461 -0.175954 -0.487917 -0.490600 -0.492232 -0.488393 -0.223946 -0.063705 -0.064977 -0.055092 0.409620 0.575001 -0.164219 -0.265208 -0.088133 0.012126 -0.078904 0.044657 -0.104268 -0.070106 0.418990 -0.064434 -0.066670 -0.164257 -0.164735 0.527609
polarizability: 6.13228514e+02 1.56492901e+01 3.17518148e+02 2.45994323e+00 -1.96020239e-01 1.37857146e+02
1716.lowfreq: -0.0018 -0.0009 0.0004 3.8613 5.4714 7.2209 22.8048 28.3606 38.7444
frequency: 22.7957 28.2930 38.7048 39.7432 49.5293 68.2735 72.2369 88.0636 115.0574 124.5592 141.3240 161.9044 168.9681 171.5821 177.5605 202.3527 210.3386 234.9078 237.2486 240.7808 281.7027 287.4725 295.1113 308.0124 324.2968 330.7413 336.7027 352.0220 384.4505 385.4560 403.8890 410.4013 414.0371 422.9803 429.0124 438.0438 500.0883 506.1186 518.8385 534.4263 542.8661 549.9758 580.3543 600.0380 609.1338 624.3025 634.9919 652.8929 678.9039 713.5434 726.2168 749.3695 768.4968 811.5075 817.5719 819.4396 832.2940 836.1859 837.8195 858.4438 869.2674 915.4928 922.6925 956.2455 962.9587 967.9263 971.3565 973.3284 977.0878 991.8814 1018.0664 1028.1266 1048.7425 1051.2842 1072.7158 1077.8996 1089.4314 1118.0650 1139.4683 1174.6191 1184.9031 1236.8267 1254.6838 1309.4962 1314.7161 1317.5021 1351.0163 1354.8326 1386.7900 1392.3104 1401.3210 1419.5719 1459.1617 1478.3245 1518.9633 1525.3464 1558.6231 1583.7211 1595.2144 1613.1237 1633.5387 1647.6336 3134.4002 3137.5126 3145.2233 3158.4748 3167.3344 3181.7125 3184.2953 3186.5028 3478.2280 3480.1736 3559.8067 3699.1833
redmass: 8.7728 8.0978 3.8874 9.6399 8.0263 6.6465 6.3124 9.8154 7.2446 6.7323 8.4414 4.1475 2.7791 4.5153 2.9274 2.7554 3.3758 5.2472 6.4456 3.6499 4.9478 5.2397 4.8568 7.0210 8.6532 7.8363 7.4716 5.8550 4.6397 4.7618 1.0218 9.5008 2.9564 9.4389 1.3186 6.2464 6.6354 6.5251 2.8050 8.9889 9.2146 6.6136 6.3284 4.5753 5.5732 7.2716 6.8659 9.5230 7.9850 3.0849 3.5183 7.9110 7.4735 2.8095 1.2627 5.3129 10.9749 12.2496 1.8027 2.3793 5.0369 12.4713 1.4354 1.6245 9.3254 1.3482 14.7849 1.3399 1.4399 3.3890 1.5239 4.0001 1.1754 1.2265 2.7011 3.3804 5.2008 1.9449 1.2482 1.7493 1.1222 2.2123 2.0030 2.9708 1.8601 1.7570 4.3867 6.8674 4.2049 2.4825 5.1848 5.4865 4.0465 7.7851 3.3879 4.9326 9.0435 7.5111 8.2551 7.8330 3.2480 1.4146 1.0904 1.0903 1.0928 1.0933 1.0885 1.0944 1.0954 1.0978 1.0662 1.0662 1.0452 1.1041
irintensity: 1.5952 0.1397 0.0415 0.2696 0.5873 3.2549 0.4538 0.1301 0.7957 2.7248 0.5209 10.6789 41.1941 8.2049 14.9774 18.0971 3.4084 14.6636 2.9324 40.7935 66.7503 34.1111 12.9270 0.8956 22.1229 10.6131 6.1216 2.2565 25.9723 22.9956 0.0150 86.2799 0.0036 90.8383 304.8382 14.9754 47.0841 28.2765 17.9524 73.8483 85.4718 36.8926 53.6051 36.9412 6.4854 42.9715 0.2516 5.1744 21.7464 0.7755 0.0858 5.8455 2.3912 2.0574 0.0338 2.1089 86.2571 59.0379 101.6821 69.4668 3.2167 6.7378 13.4687 12.4594 89.1102 1.5357 77.7545 0.0645 3.3230 0.1146 0.2981 15.8673 12.9647 147.4893 45.9087 24.4379 6.4118 0.2729 12.9721 1.5472 130.2884 39.3233 4.6833 1.2797 16.5610 31.6482 159.0869 51.5846 67.8902 2.2021 4.9874 4.0664 0.0337 369.8774 41.1679 28.9049 0.0958 5.8657 5.0557 3.7575 209.2060 556.9859 13.9742 34.5738 50.1293 6.8505 6.6621 0.7492 3.6254 2.2532 53.4080 54.5100 241.5284 25.5067
temp: 298.150 k
press: 1.00000 atm
elementType: 16 16 8 8 8 8 8 8 7 7 7 7 6 6 6 6 6 6 6 6 6 6 6 6 6 6 6 6 1 1 1 1 1 1 1 1 1 1 1 1
symmnumber: 1
zpe: 694309.6 jmol-1
zpe.correction: 0.264449 hartree
zpe.thermalcorrener: 0.290710 hartree
zpe.thermalcorrenthalpy: 0.291655 hartree
zpe.thermalcorrgfe: 0.206926 hartree
zpe.sumelectzpe: -2081.030742 hartree
zpe.sumelectthermal: -2081.004480 hartree
zpe.sumelectthermalent: -2081.003536 hartree
zpe.sumelectthermalfe: -2081.088265 hartree
dipole: 10.7135 -1.1283 2.8576
dipole: 11.1453
quadrupole: -123.3660 -172.9386 -185.3815
quadrupole: 10.6378 -14.8084 2.2558
quadrupole: 37.1961 -12.3766 -24.8195 10.6378 -14.8084 2.2558
hfenergy: -2081.2951903 hartree
pointgroup: C01 [X(C16H12N4O6S2)]
dipole: -4.2276477 0.4201378 1.0853279 debye
polarizability: 613.110161|16.7255433|317.622946|2.4039952|1.6994623|137.870701 unknown
InChI: InChI=1S/C16H12N4O6S2/c17-9-1-3-10(4-2-9)20-18-14-6-5-12-13(16(14)19-20)7-11(27(21,22)23)8-15(12)28(24,25)26/h1-8,21,24H,17H2
charge 0 multiplicity 1
40 atoms
S  4.636369 1.942887 -0.02149
S  3.162264 -3.410536 -0.104886
O  4.357831 2.492361 1.730505
O  3.33427 -3.584411 1.735143
O  6.036672 1.143539 -0.127632
O  4.367176 3.21219 -0.988621
O  1.927783 -4.322738 -0.611711
O  4.628394 -3.547055 -0.772347
N  -2.653608 0.565516 -0.007629
N  -1.632966 -0.367876 -0.024952
N  -2.272864 1.894536 0.009868
N  -8.090008 -0.974676 -0.011844
C  0.871883 0.03371 -0.029691
C  1.854025 1.107748 -0.014301
C  -0.509056 0.42566 -0.018086
C  3.219421 0.688626 -0.023614
C  1.278945 -1.327727 -0.044964
C  -0.896124 1.807921 0.002939
C  2.63903 -1.615693 -0.053754
C  3.653417 -0.634588 -0.037293
C  1.427417 2.493552 0.003159
C  0.083485 2.847626 0.013192
C  -4.025366 0.175846 -0.008394
C  -4.367311 -1.198855 -0.028575
C  -5.03703 1.167427 0.010613
C  -5.716645 -1.578902 -0.029532
C  -6.385662 0.784526 0.009614
C  -6.753072 -0.595887 -0.010538
H  0.530058 -2.12624 -0.064245
H  4.718045 -0.893922 -0.054831
H  2.187983 3.277539 -0.00321
H  -0.223512 3.896932 0.025934
H  -3.573817 -1.950108 -0.043804
H  -4.752813 2.222556 0.025684
H  5.053114 3.180545 1.946288
H  -5.977929 -2.643258 -0.045647
H  -7.166161 1.553964 0.024128
H  3.73043 -4.485328 1.921749
H  -8.355322 -1.955552 -0.027886
H  -8.830547 -0.278852 0.000362
