program: Gaussian 09
title: 000113119
version: EM64L-G09RevD.01
frameworkgroup: C1[X(C10H6N2O4S)]
method: RPBEPBE
basis: SDD
operation: Freq
keyword: #p
keyword: freq=noraman
keyword: PBEPBE/SDD
title: #p freq=noraman PBEPBE/SDD
converged: NO YES NO NO
title: Mulliken charges:
elementType: S O O O O N N C C C C C C C C C C H H H H H H
charge: 0.968022 -0.233275 -0.560847 -0.497213 -0.495792 -0.003542 0.028921 0.498884 0.297579 -0.228369 -0.007744 -0.368798 -0.380308 0.014509 -0.265534 -0.322565 -0.228279 0.288118 0.285305 0.300856 0.268663 0.256007 0.385399
chargesum: 0.00000
title: Mulliken charges with hydrogens summed into heavy atoms:
elementType: S O O O O N N C C C C C C C C C C
charge: 0.968022 -0.233275 -0.175447 -0.497213 -0.495792 -0.003542 0.028921 0.498884 0.297579 -0.228369 -0.007744 -0.080679 -0.095003 0.014509 0.035322 -0.053901 0.027728
polarizability: 2.45406243e+02 -1.75770129e+01 1.80533262e+02 1.64901188e+00 9.73229178e-01 7.81344413e+01
1716.lowfreq: -6.5373 -0.4872 0.0023 0.0023 0.0023 3.9480 41.5360 56.4376 118.5505
frequency: 41.5135 56.4340 118.5481 127.0295 142.3520 177.5208 195.4184 219.9276 232.4738 241.1615 265.3771 283.2436 292.6165 326.5940 340.2031 415.3276 443.8912 468.9999 486.2850 508.4015 536.0656 558.2521 567.8734 596.9761 631.1586 689.9238 694.1009 747.8251 770.7291 776.8099 816.7112 831.6488 843.4686 858.7540 956.6762 960.9555 969.4544 990.9592 1004.2417 1048.3645 1065.6938 1087.5837 1154.9196 1191.2231 1227.1620 1243.7021 1266.2096 1351.8587 1379.3134 1403.0941 1421.8913 1435.8016 1514.5124 1540.3854 1550.8113 1601.6883 1621.3176 3150.5241 3159.5341 3174.8551 3180.1713 3192.8145 3477.9497
redmass: 9.7839 7.5531 8.2071 8.0431 7.3338 2.3431 6.1906 5.0814 5.1804 3.9827 5.0445 6.2800 4.3630 8.7850 9.4310 10.7395 9.4014 3.6987 8.0833 8.0067 6.3376 10.1932 3.8326 6.6276 7.1470 6.8081 4.0155 7.9487 2.1609 10.1980 1.5341 4.9817 3.1370 5.4351 1.4031 4.8461 1.6017 7.4180 1.3692 1.1858 2.1837 2.8169 1.4140 1.3326 3.2866 2.8406 2.1745 2.7961 2.7692 3.0354 4.7482 3.8104 4.7791 5.8340 9.9824 8.4355 7.3456 1.0891 1.0914 1.0889 1.0995 1.0985 1.0662
irintensity: 0.2931 2.6471 0.6768 2.1159 3.5061 40.4955 5.2084 4.3269 7.9909 95.9582 3.1875 7.5962 9.7643 37.2097 19.9719 76.1048 8.2019 5.5178 3.8964 39.5512 12.6053 75.7362 24.9123 2.6514 19.0896 6.4429 0.7597 2.4600 16.9528 2.4518 68.0498 77.6068 24.7006 2.2251 3.5658 78.7639 10.7476 4.5929 1.9069 74.0301 11.3509 4.2779 1.2843 7.3456 9.1989 2.1895 12.1559 77.9310 1.8553 22.7788 9.5128 37.1190 7.8440 102.6177 149.1497 19.9072 16.8566 6.2598 2.5241 3.8681 5.1601 1.4898 49.6893
temp: 298.150 k
press: 1.00000 atm
elementType: 16 8 8 8 8 7 7 6 6 6 6 6 6 6 6 6 6 1 1 1 1 1 1
symmnumber: 1
zpe: 380575.7 jmol-1
zpe.correction: 0.144954 hartree
zpe.thermalcorrener: 0.159630 hartree
zpe.thermalcorrenthalpy: 0.160574 hartree
zpe.thermalcorrgfe: 0.103209 hartree
zpe.sumelectzpe: -1191.715957 hartree
zpe.sumelectthermal: -1191.701280 hartree
zpe.sumelectthermalent: -1191.700336 hartree
zpe.sumelectthermalfe: -1191.757702 hartree
dipole: -0.0816 0.6581 1.3046
dipole: 1.4635
quadrupole: -128.5790 -90.5080 -108.5875
quadrupole: -1.9775 -7.9037 -4.5434
quadrupole: -19.3542 18.7168 0.6373 -1.9775 -7.9037 -4.5434
hfenergy: -1191.8609106 hartree
pointgroup: C01 [X(C10H6N2O4S1)]
dipole: 0.0322693 -0.2739058 0.5054259 debye
dipolederiv: 1.924405 0.1935881 0.0213476 0.4381867 1.2847745 0.0995949 0.1840963 0.1389153 1.5782734 -0.8233842 0.1205677 -0.000649 -0.0144011 -0.5597609 -0.005342 0.0059402 -0.0062749 -0.1671082 -0.5257756 0.034899 -0.1169949 -0.0346501 -0.5398259 -0.2152443 -0.255409 -0.2153528 -0.9534889 -0.8053088 0.0337024 0.0432138 -0.0085147 -0.5227345 -0.050654 -0.0220478 -0.0051031 -0.460676 -0.6832184 -0.0699133 -0.0380113 -0.1237365 -0.5806942 0.1253109 -0.0061079 0.0416996 -0.5399548 0.9016377 -0.5165024 -0.0065206 0.6120422 -0.7576628 -0.0093589 0.0002196 -0.0044046 -0.0036996 -0.4901758 0.1577012 -0.000345 -0.9979411 0.9141601 0.0116856 -0.0079032 0.0099799 -0.0606877 0.0102689 -0.0733082 -0.0056212 -0.7478913 0.1709698 -0.0134828 0.0032905 0.0013322 0.0751138 -0.0939805 -0.228557 -0.0054893 0.2072887 -0.0211257 0.0049094 -0.0093354 -0.0050257 0.0181469 -0.1194831 0.1471876 0.0006152 0.1500154 -0.1790402 0.0195272 0.0989872 0.074169 -0.157545 0.6546063 0.0726901 0.0024383 0.1706869 0.1495012 0.0001584 -0.0007258 0.0025754 0.10571 -0.3204954 0.1879896 0.0077922 0.3475025 -0.1773546 0.0080458 0.012653 -0.0186493 -0.1305931 0.1220595 0.1120536 0.0012147 -0.1657551 0.0368172 -0.0012965 -0.0012899 0.0031101 -0.0851665 -0.401434 0.2763591 0.0017731 -0.0310688 0.0038695 -0.0020885 -0.0009677 -0.0028914 0.0134912 -0.1528009 -0.1003488 -0.0034879 0.1934389 0.0557803 0.0035716 -0.0097844 -0.010845 -0.0654334 0.4802872 -0.1463848 -0.0032494 0.1894902 0.1073739 0.0011261 0.0034713 0.0043897 -0.0852479 -0.2380851 -0.0682434 -0.0044959 -0.0528598 0.1052707 -0.0004689 -0.0113459 -0.0068007 -0.152724 0.1000869 -0.0621647 0.0037487 -0.0072899 0.0769373 -0.0029387 -0.0193065 0.0123386 0.1379433 0.0434019 -0.0789334 -0.0006786 -0.0335499 0.0772283 -0.0012431 -0.0001444 -0.0011616 0.1552377 0.0904589 0.0426901 0.006982 0.0167117 0.1592852 0.0058555 0.0076729 0.0029123 0.1569731 0.085942 0.0341646 0.0016152 0.0093161 0.0059843 -0.0016581 0.0006213 -0.0011813 0.1690665 0.0534629 0.0140838 -0.0004572 0.0091301 -0.0642442 -0.0040131 0.004708 0.0000698 0.1692239 0.1875246 -0.0833209 0.0952595 -0.1261511 0.2544908 0.0280035 0.0227077 -0.0138011 0.2831455 unknown
polarizability: 246.4953239|-15.4252228|179.431248|0.6078231|1.94498|78.1473748 unknown
InChI: InChI=1S/C10H6N2O4S/c11-12-8-5-4-6-7(10(8)13)2-1-3-9(6)17(14,15)16/h1-5,14H
charge 0 multiplicity 1
23 atoms
S  3.150587 0.564985 -0.02967
O  -3.266149 -1.116173 -0.016803
O  2.973733 1.113474 1.737491
O  4.45241 -0.38084 -0.174796
O  3.015986 1.877757 -0.968068
N  -3.726904 1.231825 0.01458
N  -4.485463 0.249859 0.009848
C  0.293993 0.061028 -0.021879
C  -0.791386 -0.907323 -0.028764
C  1.601345 -0.516343 -0.02979
C  -2.137911 -0.395186 -0.014532
C  0.024935 1.481914 -0.006358
C  -0.533284 -2.309704 -0.043693
C  -2.343632 1.022564 0.003958
C  1.869877 -1.883145 -0.042001
C  -1.279147 1.963723 0.007435
C  0.777395 -2.795965 -0.053194
H  0.861553 2.183326 -0.020417
H  -1.386571 -2.995013 -0.048625
H  2.906474 -2.236419 -0.047215
H  -1.493151 3.035167 0.017944
H  0.973278 -3.871643 -0.064938
H  3.735134 1.732432 1.939087
