program: Gaussian 09
title: 000113081
version: EM64L-G09RevD.01
frameworkgroup: C1[X(C11H14NO3S3)]
method: RPBEPBE
basis: SDD
operation: Freq
keyword: #p
keyword: freq=noraman
keyword: PBEPBE/SDD
title: #p freq=noraman PBEPBE/SDD
converged: YES YES NO NO
title: Mulliken charges:
elementType: S S S O O O N C C C C C C C C C C C H H H H H H H H H H H H H H
charge: 1.051684 0.414533 0.379393 -0.561169 -0.481358 -0.504640 -0.087602 -0.451869 -0.322411 0.664614 -0.611002 -0.424801 -0.371248 -0.305550 -0.259043 -0.202326 -0.214459 -0.797067 0.270460 0.272448 0.263072 0.279786 0.303659 0.307729 0.269766 0.275187 0.267002 0.270105 0.402114 0.302499 0.301948 0.298544
chargesum: 1.00000
title: Mulliken charges with hydrogens summed into heavy atoms:
elementType: S S S O O O N C C C C C C C C C C C
charge: 1.051684 0.414533 0.379393 -0.159055 -0.481358 -0.504640 -0.087602 0.091039 0.220447 0.664614 0.000386 -0.424801 -0.371248 -0.035784 0.016145 0.064676 0.055646 0.105924
polarizability: 2.13945836e+02 1.10096254e+00 2.60205932e+02 -2.64956275e+01 2.17220987e+00 1.19434715e+02
1716.lowfreq: -9.1133 -5.1940 -3.5261 -0.0018 -0.0016 -0.0013 5.2792 10.7767 35.4385
frequency: -7.8205 9.0809 35.4042 50.4963 62.8362 74.6983 100.5733 126.5024 136.9394 163.6301 175.8642 187.7592 206.9606 229.5148 256.1474 261.2708 282.3518 301.8956 307.3770 328.5756 360.8521 375.6165 406.4475 415.6278 422.4383 495.3680 505.1382 541.3965 564.4662 597.7990 598.7359 635.5955 656.4362 680.4534 720.9934 765.1451 766.6339 797.3957 843.7026 854.3570 859.1773 950.0995 953.4041 957.1773 980.2247 1004.8720 1010.8260 1013.5361 1023.0073 1026.8588 1047.7605 1065.9650 1071.5394 1103.6926 1145.0798 1162.4739 1190.3889 1243.4196 1248.8523 1279.8966 1292.3766 1308.8698 1334.8962 1356.4478 1372.7335 1400.4676 1413.8840 1421.7674 1441.7325 1449.3360 1449.9566 1461.8100 1485.2678 1501.4096 1590.4396 1595.1709 3000.9851 3024.9911 3029.2674 3060.0018 3063.5699 3093.0737 3152.9712 3157.4333 3161.0705 3161.2015 3167.9124 3177.8030 3190.2502 3493.4499
redmass: 6.7233 11.4073 6.1715 4.6974 4.3148 5.9498 3.2974 3.7556 3.4537 4.0770 1.1281 3.8896 3.7492 4.3998 3.8411 2.5580 4.0020 2.9271 2.8986 8.7391 8.2302 7.8780 7.0570 7.1035 3.1255 8.2586 5.0150 5.8760 14.4927 5.6058 5.9558 7.7853 5.9913 6.3515 3.4529 1.3722 1.2410 2.8517 12.8643 1.5338 1.3582 4.9108 4.1957 1.3716 1.1743 1.3578 2.0715 2.8813 2.6936 2.1993 1.8578 2.1826 1.7205 3.6159 1.4746 1.4297 1.1106 1.3150 1.4730 1.4184 2.1037 1.1616 1.2873 1.1299 1.3520 9.1061 2.7569 1.1090 1.0703 1.1222 2.0147 2.8758 1.1049 1.1117 6.7427 7.1785 1.0610 1.0279 1.0599 1.0582 1.1013 1.1059 1.1111 1.1046 1.0880 1.1080 1.0908 1.0962 1.1010 1.0666
irintensity: 1.2480 0.9909 1.9686 1.2803 3.0858 1.3725 0.1092 0.2275 0.7304 2.7399 0.5787 9.5878 7.2050 11.6803 9.3332 27.8864 11.8991 5.5832 89.3152 15.9069 19.3240 36.2841 1.2717 4.0947 7.0491 0.8476 3.6769 13.8459 136.9448 8.0265 5.0854 8.1067 14.9822 7.2113 6.2558 88.6418 10.2127 1.0873 50.0032 4.5189 0.0525 13.7028 74.6689 0.7637 3.5430 0.1114 9.5492 11.5814 23.3865 1.1522 30.6616 28.5909 38.2223 30.5453 7.9014 8.7539 0.9799 8.8395 11.5389 4.0401 33.2124 0.9368 10.7719 0.7015 26.3418 2.5016 114.5988 7.4155 35.1983 23.3073 30.0874 13.5533 7.2667 33.5919 0.0915 12.9121 8.3683 1.0142 6.0157 1.3360 0.6278 3.9940 0.2084 0.1270 0.3942 1.0484 1.6410 0.6161 0.7134 95.8299
temp: 298.150 k
press: 1.00000 atm
elementType: 16 16 16 8 8 8 7 6 6 6 6 6 6 6 6 6 6 6 1 1 1 1 1 1 1 1 1 1 1 1 1 1
symmnumber: 1
zpe: 618776.0 jmol-1
zpe.correction: 0.235679 hartree
zpe.thermalcorrener: 0.254613 hartree
zpe.thermalcorrenthalpy: 0.255557 hartree
zpe.thermalcorrgfe: 0.185967 hartree
zpe.sumelectzpe: -1900.409811 hartree
zpe.sumelectthermal: -1900.390877 hartree
zpe.sumelectthermalent: -1900.389933 hartree
zpe.sumelectthermalfe: -1900.459523 hartree
dipole: 8.9959 -1.7641 3.2471
dipole: 9.7253
quadrupole: -80.9076 -85.9567 -129.0704
quadrupole: -5.8036 -17.2154 1.0213
quadrupole: 17.7373 12.6882 -30.4255 -5.8036 -17.2154 1.0213
hfenergy: -1900.6454904 hartree
pointgroup: C01 [X(C11H14N1O3S3)]
dipole: -3.2047778 -1.8528729 -0.9675777 debye
polarizability: 215.4757605|-17.2003764|253.5383075|-30.6165998|-15.2360645|124.5724162 unknown
InChI: InChI=1S/C11H14NO3S3/c1-16-11-12(7-4-8-18(13,14)15)9-5-2-3-6-10(9)17-11/h2-3,5-6,13H,4,7-8H2,1H3
charge 1 multiplicity 1
32 atoms
S  4.173203 1.251731 0.190648
S  -2.688854 -1.758414 0.949963
S  -0.158244 -3.345486 -0.061009
O  5.205526 1.797443 -1.238625
O  5.009089 0.280234 1.172654
O  3.32088 2.486237 0.798895
N  -0.712181 -0.670938 -0.410779
C  0.578931 -0.490325 -1.140324
C  1.691005 0.0074 -0.184538
C  -1.59173 0.423365 -0.151363
C  2.998539 0.231158 -0.951609
C  -1.119427 -1.863221 0.102195
C  -2.743788 0.027198 0.575907
C  -1.417595 1.770323 -0.538671
C  -3.751383 0.938446 0.932575
C  -2.42347 2.690714 -0.183626
C  -3.575515 2.284181 0.540168
C  -1.287416 -4.621941 0.758696
H  0.398019 0.229997 -1.956563
H  0.848509 -1.453567 -1.607547
H  1.845342 -0.725067 0.628456
H  1.378244 0.961717 0.28074
H  2.899372 0.878912 -1.836892
H  3.576801 -0.676058 -1.181765
H  -0.5339 2.106326 -1.08783
H  -4.637929 0.628928 1.492702
H  -2.309706 3.74054 -0.468676
H  -4.338587 3.022433 0.802797
H  6.016127 2.277395 -0.901023
H  -2.236686 -4.690675 0.208208
H  -1.434428 -4.364579 1.817629
H  -0.731651 -5.567407 0.674907
