program: Gaussian 09
title: 000113024
version: EM64L-G09RevD.01
frameworkgroup: C1[X(C17H18NO2)]
method: RPBEPBE
basis: SDD
operation: Freq
keyword: #p
keyword: freq=noraman
keyword: PBEPBE/SDD
title: #p freq=noraman PBEPBE/SDD
converged: YES YES NO NO
title: Mulliken charges:
elementType: O O N C C C C C C C C C C C C C C C C C H H H H H H H H H H H H H H H H H H
charge: -0.182690 -0.295472 -0.197482 0.291958 -0.423090 0.151848 0.393883 -0.472793 0.412627 -0.339614 -0.213462 -0.367785 -0.756476 0.323488 -0.379260 -0.378566 -0.232811 -0.227257 -0.224146 -0.486577 0.279080 0.249012 0.311380 0.282452 0.232684 0.205278 0.274339 0.282708 0.270846 0.301860 0.236116 0.239850 0.243221 0.245353 0.250468 0.221226 0.250761 0.227044
chargesum: 1.00000
title: Mulliken charges with hydrogens summed into heavy atoms:
elementType: O O N C C C C C C C C C C C C C C C C C
charge: -0.182690 -0.295472 -0.197482 0.291958 0.105002 0.151848 0.393883 -0.161412 0.412627 -0.057162 0.224500 -0.093446 0.098938 0.323488 -0.143145 -0.138716 0.010411 0.018096 0.026322 0.212454
polarizability: 3.20606602e+02 -1.91391889e+01 1.77842309e+02 -1.21127972e+01 -2.81233793e+01 1.23693390e+02
1716.lowfreq: -9.2013 -6.7214 -0.0008 -0.0007 -0.0007 3.9353 23.3199 42.7252 53.4780
frequency: 23.0203 42.6932 53.4611 59.5535 75.9700 81.0332 96.9091 121.1330 137.7998 175.9321 198.6385 219.9970 248.2655 257.6499 268.0381 296.0215 338.7206 365.8642 399.1269 402.6953 435.0410 483.6082 504.4285 524.4692 537.4752 581.7969 612.0555 618.0302 637.6535 666.1110 691.2615 700.2331 726.4062 748.7300 772.2182 790.2032 827.8269 834.8578 848.9505 887.6371 897.8639 928.7266 960.3975 971.1808 976.8703 978.9626 989.4238 1004.5548 1007.0991 1012.9245 1036.3794 1038.3312 1058.3251 1087.6117 1090.7442 1092.4460 1118.7310 1133.5414 1158.6355 1174.0646 1181.5822 1200.9493 1211.2263 1219.0104 1272.3556 1291.0562 1305.0486 1318.5917 1340.5750 1355.1965 1373.8865 1378.1931 1386.3318 1411.3093 1429.8717 1441.4369 1443.6029 1448.6621 1456.1550 1462.5925 1463.2222 1464.4670 1470.3966 1479.9957 1501.5635 1540.6393 1583.3710 1606.6329 1614.0815 1624.5114 2932.8496 2960.6104 2983.6186 2996.5586 3044.6566 3048.2975 3079.8313 3109.3986 3129.7856 3130.3934 3131.5511 3131.7735 3148.1375 3159.1318 3168.6865 3175.7190 3192.1749 3195.3256
redmass: 3.8105 3.7127 3.0847 4.0590 1.1271 2.6112 3.1278 3.3763 3.8866 4.5576 1.9485 1.8521 4.3697 4.2972 4.1479 2.4077 4.3053 3.7088 3.7198 3.1279 3.3362 3.5476 4.3854 3.6884 3.4695 4.2764 5.0386 4.8808 5.6090 4.3620 5.5586 1.7539 4.2202 4.9380 1.8378 2.8824 5.0940 1.4616 1.2920 1.5402 3.6485 1.4230 2.2459 1.3716 2.3453 1.4819 4.5347 2.8308 1.3551 2.2843 1.9621 1.5107 3.5524 3.6599 1.7403 1.9658 1.3712 2.2804 1.5537 1.6661 1.0547 1.1581 1.1736 2.6162 1.8172 1.5344 1.6136 1.7050 2.0973 1.8238 3.3358 1.4008 5.7858 1.2350 3.1596 1.2209 2.1419 1.1644 1.0782 1.7025 1.0820 1.0781 1.3715 1.0882 2.7928 5.1326 5.7307 6.4874 7.0710 8.6048 1.0557 1.0332 1.1056 1.0406 1.0614 1.1043 1.0962 1.1049 1.0882 1.0985 1.0999 1.0879 1.0908 1.0958 1.0902 1.1015 1.0937 1.0973
irintensity: 0.8750 0.8321 0.5132 0.1342 0.5628 6.8959 3.3223 0.6930 0.9041 0.5488 5.4872 1.7950 1.4161 0.2089 4.1312 2.1265 0.7112 1.2210 1.5174 1.8026 6.9399 0.5460 4.3307 9.2546 5.1867 13.9736 0.6707 1.1811 4.9535 3.9978 2.4495 44.8105 0.3554 8.0518 86.8898 5.6321 19.5450 26.6722 1.0211 20.3510 9.4706 0.4586 9.6879 0.8333 16.0656 1.6848 3.4798 7.9774 0.4152 5.2381 4.2926 16.2991 38.5310 41.1310 10.0204 3.3604 1.0465 1.4556 12.0683 7.5473 0.0148 6.7693 2.2833 6.4480 9.9639 22.5255 15.8762 6.4266 59.1763 7.8524 9.0079 8.1056 18.4300 34.7767 26.4166 5.5532 8.2369 44.2451 12.3296 49.7662 23.5485 19.7977 3.6827 9.1250 16.3790 34.4328 2.1442 67.9222 9.2663 33.2946 45.5094 59.8348 37.0657 2.5336 13.5507 36.3191 0.4957 2.7380 5.5864 0.3987 11.2835 6.2621 2.5922 18.7308 1.3475 15.4329 5.1157 0.3919
temp: 298.150 k
press: 1.00000 atm
elementType: 8 8 7 6 6 6 6 6 6 6 6 6 6 6 6 6 6 6 6 6 1 1 1 1 1 1 1 1 1 1 1 1 1 1 1 1 1 1
symmnumber: 1
zpe: 813480.6 jmol-1
zpe.correction: 0.309838 hartree
zpe.thermalcorrener: 0.328234 hartree
zpe.thermalcorrenthalpy: 0.329178 hartree
zpe.thermalcorrgfe: 0.261746 hartree
zpe.sumelectzpe: -862.130408 hartree
zpe.sumelectthermal: -862.112013 hartree
zpe.sumelectthermalent: -862.111068 hartree
zpe.sumelectthermalfe: -862.178500 hartree
dipole: 8.3163 1.1098 -0.4467
dipole: 8.4019
quadrupole: -42.6929 -88.6427 -108.4836
quadrupole: 3.4181 -6.5939 -3.7801
quadrupole: 37.2468 -8.7030 -28.5438 3.4181 -6.5939 -3.7801
hfenergy: -862.4402463 hartree
pointgroup: C01 [X(C17H18N1O2)]
dipole: 3.2652563 -0.2429019 0.4537991 debye
polarizability: 316.9397933|30.1523242|164.333394|18.7715424|-35.3621952|140.8691144 unknown
InChI: InChI=1S/C17H18NO2/c1-13-18(10-11-19-2)16-12-15(8-9-17(16)20-13)14-6-4-3-5-7-14/h3-9,12H,10-11H2,1-2H3
charge 1 multiplicity 1
38 atoms
O  2.823317 2.085791 -0.621227
O  1.548157 -2.624912 0.212768
N  2.549041 0.187754 0.535062
C  1.240789 0.579387 0.103775
C  2.875658 -0.994838 1.37661
C  1.425477 1.780294 -0.618344
C  3.45079 1.096035 0.089286
C  -0.031844 0.013343 0.270548
C  -1.131788 0.711187 -0.301432
C  0.377274 2.493897 -1.203186
C  2.91649 -2.316549 0.596938
C  -0.903901 1.93489 -1.019727
C  4.920199 1.14865 0.291249
C  -2.51302 0.173141 -0.163485
C  -2.899797 -0.542027 1.004079
C  -3.472755 0.356895 -1.197554
C  -4.205876 -1.056584 1.134423
C  -4.778085 -0.160762 -1.067813
C  -5.150511 -0.868755 0.098405
C  1.425104 -3.901864 -0.511104
H  2.106026 -1.064902 2.163861
H  3.848945 -0.811654 1.860582
H  -0.157474 -0.958967 0.750323
H  0.534269 3.425896 -1.750053
H  3.329657 -3.097821 1.272302
H  3.580439 -2.241105 -0.292814
H  -1.766446 2.471559 -1.42495
H  5.174725 1.377738 1.343252
H  5.404109 0.19335 0.024279
H  5.343851 1.944419 -0.339748
H  -2.19155 -0.663193 1.831963
H  -3.193031 0.872582 -2.123333
H  -4.491722 -1.591326 2.046092
H  -5.501317 -0.019196 -1.877461
H  -6.165378 -1.266766 0.199955
H  2.006433 -3.882938 -1.454091
H  0.355724 -4.017674 -0.739088
H  1.765023 -4.747573 0.118558
