program: Gaussian 09
title: 000001633
version: EM64L-G09RevD.01
frameworkgroup: C1[X(C20H21N3O2)]
method: RPBEPBE
basis: SDD
operation: Freq
keyword: #p
keyword: freq=noraman
keyword: PBEPBE/SDD
title: #p freq=noraman PBEPBE/SDD
converged: YES YES NO NO
title: Mulliken charges:
elementType: O O N N N C C C C C C C C C C C C C C C C C C C C H H H H H H H H H H H H H H H H H H H H H
charge: -0.236043 -0.272034 -0.178866 -0.067349 -0.420791 -0.293404 -0.397165 -0.370994 -0.584824 -0.377849 -0.416293 0.280141 0.430814 0.501896 0.086697 0.232609 -0.389735 -0.366897 -0.391440 -0.497437 -0.404679 -0.345385 -0.049588 -0.255270 -0.205340 0.274403 0.236592 0.218844 0.229214 0.218543 0.238594 0.228202 0.258271 0.238808 0.231043 0.228491 0.229713 0.230596 0.318928 0.293457 0.221088 0.241727 0.237360 0.159828 0.227821 0.227702
chargesum: 0.00000
title: Mulliken charges with hydrogens summed into heavy atoms:
elementType: O O N N N C C C C C C C C C C C C C C C C C C C C
charge: -0.236043 -0.272034 -0.178866 -0.067349 -0.101862 -0.019001 0.058271 0.076764 -0.118028 0.119230 0.043240 0.280141 0.430814 0.501896 0.086697 0.232609 -0.160022 -0.136301 -0.097983 -0.276349 -0.162952 -0.108024 0.110239 -0.027449 0.022362
polarizability: 3.88429706e+02 1.58794211e+01 2.26326521e+02 3.66029182e+00 -1.27593539e+00 1.37344095e+02
1716.lowfreq: -14.6190 -5.4910 -0.5021 -0.0008 -0.0007 -0.0006 10.5311 16.1683 24.3131
frequency: 9.9316 15.1374 24.3060 35.2234 50.0499 77.0383 84.1515 106.2404 127.2116 135.3062 164.1087 178.2058 212.5127 237.3003 247.7108 268.9389 286.0624 300.5619 322.7557 341.9074 352.8608 365.4975 416.9644 434.4742 446.9417 460.4813 480.1266 489.8912 516.5555 529.6234 556.1197 572.8684 609.7705 616.9663 636.2573 641.4413 661.8184 676.3387 699.3219 724.5839 737.2411 759.1900 789.1386 793.2346 798.5877 805.3278 826.1066 849.4069 860.0362 868.6668 886.8124 923.7194 931.1430 937.3782 956.4172 961.8074 967.8731 976.4405 988.9081 999.2021 1005.7060 1019.4901 1030.7264 1053.4531 1076.3045 1081.4726 1096.2925 1129.6621 1156.8554 1169.5860 1178.4103 1182.3838 1183.9614 1194.8268 1202.5303 1212.0676 1224.3275 1233.3554 1233.7933 1238.6919 1249.9944 1251.0633 1270.5404 1288.4417 1310.5715 1334.0067 1338.4327 1339.6606 1342.3204 1352.9119 1357.2463 1378.4745 1380.8415 1385.3614 1389.4110 1416.5922 1429.9431 1460.9581 1463.4938 1470.2069 1476.9738 1478.7089 1487.6711 1490.6922 1522.1804 1565.7047 1608.7405 1622.9891 1630.1359 1633.2090 1657.0132 2917.0178 2922.3316 2930.3712 2968.3220 2981.2052 2985.8205 2996.0992 3011.0001 3037.9197 3043.9171 3050.1117 3060.9156 3109.0951 3124.6196 3127.6558 3135.2573 3149.4533 3149.9853 3154.2967 3166.8369 3576.5195
redmass: 6.6644 3.8568 5.0222 5.7304 4.7301 5.4922 3.3316 6.0953 5.9557 5.0645 3.3575 5.6609 3.7259 4.4845 2.2551 4.2023 4.5174 2.2291 3.1499 4.6659 2.3701 4.4732 3.0257 3.3626 3.7005 4.4741 8.2536 3.2967 3.1765 3.1645 3.2555 3.3296 2.2006 2.3622 5.2556 3.1092 5.7056 2.7359 3.6111 3.2751 2.8017 1.5985 3.5644 2.7089 4.5967 1.6607 1.5458 1.7825 1.5164 2.5868 3.5774 2.9701 1.6047 1.4635 1.6060 1.9571 1.9910 1.3149 1.3819 2.5884 2.4980 2.1024 4.7372 2.0121 2.0537 2.0235 2.0389 1.4580 1.3411 1.0891 2.5364 1.6450 1.6542 1.4796 1.3170 1.1740 2.3652 1.4019 1.4925 3.3113 1.4136 2.0375 1.4642 2.0379 1.5079 1.4535 1.4075 1.8192 1.5560 1.3850 1.6409 2.1095 1.9145 2.5280 1.8853 3.5345 3.1358 2.7369 1.1279 1.0924 3.1565 1.0929 1.0919 1.0994 2.6806 6.5243 6.7685 6.4886 7.1059 6.1981 9.4205 1.0853 1.0682 1.0705 1.0649 1.0653 1.0649 1.0786 1.0939 1.0918 1.0996 1.0977 1.0988 1.0887 1.0903 1.0862 1.0895 1.0946 1.0932 1.0940 1.1003 1.0795
irintensity: 1.1259 0.3035 4.0133 0.1533 2.2388 1.8213 0.7158 2.5546 3.1247 1.5209 3.0071 2.2130 0.8046 11.7208 7.1612 2.1553 2.7613 2.4894 7.7716 0.5141 12.7079 3.8317 2.0363 5.0580 2.2221 3.9188 5.4036 1.2845 9.3398 37.8156 4.1358 8.6850 52.4780 43.8969 10.6898 5.0137 17.0171 13.5593 1.8357 3.4837 15.7377 82.1163 11.6141 7.2566 0.8628 47.4637 31.4508 0.1939 1.8464 2.1248 4.7388 26.3395 2.5881 3.0995 1.7817 6.6400 1.6361 0.1312 2.8404 37.1595 30.0372 9.6565 3.1466 0.1378 2.7248 0.3297 23.6573 8.7197 30.4366 0.3505 22.9362 32.6271 54.7265 82.1685 45.7796 28.3137 14.8099 80.5866 16.2992 48.4938 15.2671 11.4151 53.1665 31.8035 22.9968 1.2297 1.9688 29.4140 26.7243 23.8985 20.9503 6.6229 224.0420 40.2947 9.8020 0.0897 1.9778 31.9364 7.3507 63.5935 85.3363 42.0632 20.8217 26.5916 291.3442 3.6398 4.5052 507.6097 79.1189 73.0604 383.0652 84.6703 98.4444 49.5953 47.4134 18.0221 20.4279 13.8897 42.3933 25.5743 10.9386 28.5661 17.8359 25.9533 5.1762 3.1653 8.0671 24.3692 22.5967 30.6383 24.8937 42.6403
temp: 298.150 k
press: 1.00000 atm
elementType: 8 8 7 7 7 6 6 6 6 6 6 6 6 6 6 6 6 6 6 6 6 6 6 6 6 1 1 1 1 1 1 1 1 1 1 1 1 1 1 1 1 1 1 1 1 1
symmnumber: 1
zpe: 978649.0 jmol-1
zpe.correction: 0.372748 hartree
zpe.thermalcorrener: 0.394422 hartree
zpe.thermalcorrenthalpy: 0.395366 hartree
zpe.thermalcorrgfe: 0.318230 hartree
zpe.sumelectzpe: -1087.655294 hartree
zpe.sumelectthermal: -1087.633620 hartree
zpe.sumelectthermalent: -1087.632676 hartree
zpe.sumelectthermalfe: -1087.709811 hartree
dipole: -4.2863 -3.1139 -1.7866
dipole: 5.5911
quadrupole: -153.8799 -139.9090 -154.4728
quadrupole: -13.4252 -24.6954 1.4202
quadrupole: -4.4593 9.5116 -5.0522 -13.4252 -24.6954 1.4202
hfenergy: -1088.0280418 hartree
pointgroup: C01 [X(C20H21N3O2)]
dipole: 1.7204882 -1.2879252 0.4688776 debye
polarizability: 389.2288085|-11.4502263|221.5291427|3.0099394|18.2601646|141.3423701 unknown
InChI: InChI=1S/C20H21N3O2/c24-14-22-9-11-23(12-10-22)16-7-5-15(6-8-16)13-18-17-3-1-2-4-19(17)21-20(18)25/h1-8,14,18,21H,9-13H2
charge 0 multiplicity 1
46 atoms
O  2.651617 2.655496 1.087608
O  -8.292812 0.53483 -1.454922
N  -3.547747 -0.287442 0.202593
N  -6.401069 -0.245477 -0.316028
N  4.819105 1.940055 0.491136
C  3.073713 0.397072 0.008694
C  -4.260097 0.984338 -0.031003
C  -4.353137 -1.5218 0.249882
C  2.215732 -0.494506 0.97537
C  -5.5038 0.771733 -0.912726
C  -5.806329 -1.197427 0.644126
C  4.439781 -0.170455 -0.354886
C  -2.153633 -0.329658 0.383831
C  0.707895 -0.420801 0.759633
C  3.427193 1.793731 0.594248
C  5.443597 0.791616 -0.056571
C  -1.396893 0.857628 0.632629
C  -1.439725 -1.565264 0.328822
C  -0.001836 0.808037 0.811775
C  -0.042731 -1.597495 0.517952
C  4.80755 -1.405589 -0.909288
C  6.808439 0.553064 -0.296262
C  -7.738903 -0.27188 -0.653986
C  6.180594 -1.669992 -1.160216
C  7.164721 -0.700307 -0.855927
H  2.476736 0.567047 -0.909811
H  -3.590106 1.682032 -0.564946
H  -4.553474 1.475975 0.922655
H  -3.933003 -2.203642 1.014382
H  -4.341177 -2.064225 -0.721741
H  2.472063 -0.220926 2.017752
H  2.544676 -1.541099 0.839991
H  -6.07032 1.713054 -1.025708
H  -5.196689 0.450281 -1.927561
H  -6.404833 -2.1263 0.655601
H  -5.81421 -0.77634 1.670365
H  -1.899989 1.825814 0.720846
H  -1.963978 -2.500565 0.109216
H  5.302374 2.777817 0.815845
H  0.550437 1.735011 1.008302
H  0.473654 -2.565106 0.465019
H  4.048496 -2.158439 -1.151312
H  7.574237 1.300539 -0.063074
H  -8.291731 -1.093939 -0.141207
H  6.480271 -2.630039 -1.593413
H  8.219943 -0.917761 -1.055083
