program: Gaussian 09
title: 000112995
version: EM64L-G09RevD.01
frameworkgroup: C1[X(C5H7NO4S2)]
method: RPBEPBE
basis: SDD
operation: Freq
keyword: #p
keyword: freq=noraman
keyword: PBEPBE/SDD
title: #p freq=noraman PBEPBE/SDD
converged: YES YES NO NO
title: Mulliken charges:
elementType: S S O O O O N C C C C C H H H H H H H
charge: 0.243865 0.063119 -0.126250 -0.418583 -0.247616 -0.176343 -0.569905 -0.752486 -0.338114 0.267881 -0.347801 0.176513 0.304411 0.301574 0.279085 0.279869 0.337706 0.326189 0.396886
chargesum: 0.00000
title: Mulliken charges with hydrogens summed into heavy atoms:
elementType: S S O O O O N C C C C C
charge: 0.243865 0.063119 -0.126250 -0.021697 -0.247616 -0.176343 0.093989 -0.146500 0.220841 0.267881 -0.347801 0.176513
polarizability: 1.49036877e+02 -1.38790247e+00 1.24980565e+02 -1.20967668e+00 6.55301740e+00 6.36764422e+01
1716.lowfreq: -3.4584 -2.4381 -0.0017 -0.0015 -0.0003 6.4745 14.2927 29.6487 51.5467
frequency: 14.2234 29.6353 51.5386 77.8227 84.7741 120.4581 137.1455 171.6154 191.9222 233.3040 290.7795 390.7943 404.1010 442.3269 494.0815 499.5230 508.3887 530.4255 567.3343 608.0082 624.3905 643.2816 655.3786 745.6296 848.3929 864.2959 882.6151 907.1849 984.4463 1002.2644 1039.8885 1083.6428 1165.7868 1172.2573 1193.8399 1254.9397 1258.8153 1348.7173 1364.6502 1409.6472 1434.8095 1593.3445 1652.2050 1707.8693 3001.0682 3021.3654 3068.3319 3138.5637 3419.2943 3528.7039 3627.7269
redmass: 13.3859 8.5253 7.0824 5.0403 8.5622 5.2302 3.6379 8.7142 6.5524 7.4193 11.1943 11.6055 2.2692 5.5668 4.7920 3.6126 2.3454 5.6638 2.4248 6.8073 1.4916 1.7226 1.1470 5.1613 3.7730 4.5376 2.0004 9.3657 1.9177 9.2811 2.4130 1.6880 1.8197 2.1275 1.0811 1.4053 1.4070 3.4406 1.7232 1.1178 1.0764 1.3114 4.6943 9.5927 1.0557 1.0624 1.1053 1.1023 1.0534 1.0644 1.0978
irintensity: 0.9048 0.8527 9.4051 3.2777 1.6270 10.4037 5.1433 2.0441 3.2530 2.4081 0.0523 3.8051 18.3430 5.7527 12.0917 11.6882 31.8203 74.4422 17.4620 11.1992 139.4918 201.7053 87.2898 2.9887 0.5851 11.4286 1.9233 93.3869 0.7098 212.5628 346.8295 2.3328 204.0219 203.3264 4.1397 5.3893 0.8344 90.2180 77.2946 36.0100 39.4555 106.4761 307.2342 205.8093 8.8079 6.7212 3.1101 0.4108 99.5666 45.7271 86.0243
temp: 298.150 k
press: 1.00000 atm
elementType: 16 16 8 8 8 8 7 6 6 6 6 6 1 1 1 1 1 1 1
symmnumber: 1
zpe: 331913.2 jmol-1
zpe.correction: 0.126419 hartree
zpe.thermalcorrener: 0.140007 hartree
zpe.thermalcorrenthalpy: 0.140951 hartree
zpe.thermalcorrgfe: 0.082655 hartree
zpe.sumelectzpe: -1345.572895 hartree
zpe.sumelectthermal: -1345.559307 hartree
zpe.sumelectthermalent: -1345.558363 hartree
zpe.sumelectthermalfe: -1345.616659 hartree
dipole: -2.4824 -1.3391 -0.4283
dipole: 2.8529
quadrupole: -83.6162 -96.4675 -78.8736
quadrupole: 23.2843 -0.2734 2.8793
quadrupole: 2.7029 -10.1484 7.4455 23.2843 -0.2734 2.8793
hfenergy: -1345.6993145 hartree
pointgroup: C01 [X(C5H7N1O4S2)]
dipole: 0.9449617 -0.0457797 0.6039759 debye
dipolederiv: -0.3093634 -0.1045334 0.2060465 -0.1399431 -0.0972628 0.1505014 0.428233 0.1299896 -0.5640994 -0.482834 0.1050959 -0.271024 0.0443272 -0.2372056 0.2113993 -0.1721727 0.1999975 -0.6969416 -1.7517466 0.2804303 -0.3782919 0.3179605 -0.2555956 0.1226303 -0.1648745 0.0867262 -0.3758494 -0.7650826 0.1755503 -0.5068515 0.1900758 -0.5185929 0.2144691 -0.4970313 0.200288 -0.9170909 -0.7231968 -0.1716022 0.3013764 -0.4019006 -0.5461841 0.2093655 0.237565 0.0301621 -0.7200029 -0.7635021 -0.0062212 0.230947 0.0642935 -0.3202866 0.1075576 0.0387446 0.1381102 -0.7964759 -0.6643016 0.0901164 -0.0274642 0.0427774 -0.4768057 -0.130852 0.041481 -0.026256 -0.9652115 0.1516785 -0.1277129 -0.0613788 -0.2166759 -0.0611891 0.014077 -0.0613586 -0.0413259 0.0031418 0.1483214 -0.0136903 0.1639855 -0.1701751 0.3766826 -0.0057864 0.6359351 -0.0373816 0.2555421 0.7473606 0.4073928 -0.3492091 0.7392722 0.6073531 -0.0290067 -0.2539742 0.1186348 1.2955096 1.7456424 -0.3075075 0.2703219 -0.2035652 0.1039852 -0.5112819 -0.2999988 -0.4555402 1.2663611 1.5685983 -0.220655 0.1632971 -0.2584358 0.3503661 -0.3592695 0.1935603 -0.3553495 1.4075049 0.0199462 0.0127436 0.0377265 -0.0214278 0.1082689 -0.018095 0.0065601 -0.0660836 0.0298653 0.0323878 -0.031121 -0.0166745 -0.025206 0.0286208 0.0047628 -0.0953061 0.104098 0.0742206 0.066848 0.0348522 -0.0037135 0.076101 0.0265768 -0.0416868 -0.111015 -0.0229454 -0.0017996 0.0383646 -0.037881 -0.0059742 -0.0119181 -0.0032416 0.036924 -0.1267222 0.0412425 0.0509676 0.2786331 -0.1028295 0.039974 -0.1218686 0.2253106 -0.0156998 0.0524968 -0.0291613 0.2106101 0.4762498 0.0080659 0.1090812 0.100444 0.2848432 0.0224469 0.0099287 -0.0285543 0.1530674 0.1859964 0.0095066 0.0978254 -0.0041356 0.4043567 0.0175441 0.1379489 0.0133491 0.2906808 unknown
polarizability: 149.1170665|1.4903658|68.802392|0.1159745|-18.1581095|119.7744252 unknown
InChI: InChI=1S/C5H7NO4S2/c6-3(7)2-12-5(11)10-1-4(8)9/h8H,1-2,6H2
charge 0 multiplicity 1
19 atoms
S  -0.817646 -0.209074 0.770986
S  -0.688413 0.796444 -2.222817
O  1.387019 -0.019141 -0.801109
O  4.19899 -1.073923 1.245326
O  -4.231789 -1.530842 0.738965
O  4.115939 -0.430311 -0.998071
N  -3.322304 -1.232932 -1.389043
C  -2.612867 0.277922 0.41006
C  2.06517 -0.512933 0.414619
C  -3.464441 -0.914427 -0.05591
C  0.025382 0.197535 -0.818108
C  3.546238 -0.645025 0.081431
H  -2.998309 0.635179 1.375509
H  -2.569371 1.093006 -0.333829
H  1.934161 0.195172 1.253889
H  1.664297 -1.499532 0.7142
H  -3.844643 -2.027076 -1.758773
H  -2.680558 -0.706259 -1.99223
H  5.172647 -1.180784 1.069504
