program: Gaussian 09
title: 000112972
version: EM64L-G09RevD.01
frameworkgroup: C1[X(C10H18O6)]
method: RPBEPBE
basis: SDD
operation: Freq
keyword: #pfreq=noraman
keyword: PBEPBE/SDD
title: #p freq=noraman PBEPBE/SDD
converged: YES YES NO NO
title: Mulliken charges:
elementType: O O O O O O C C C C C C C C C C H H H H H H H H H H H H H H H H H H
charge: -0.267948 -0.267918 -0.457213 -0.458054 -0.253580 -0.253726 -0.190197 -0.189820 0.038065 0.038136 0.246306 0.246459 -0.684531 -0.672577 -0.684593 -0.672755 0.264162 0.263818 0.234833 0.234644 0.212415 0.232945 0.225644 0.210960 0.263688 0.224028 0.212457 0.232963 0.225639 0.211020 0.263709 0.224187 0.373333 0.373501
chargesum: 0.00000
title: Mulliken charges with hydrogens summed into heavy atoms:
elementType: O O O O O O C C C C C C C C C C
charge: -0.267948 -0.267918 -0.083880 -0.084553 -0.253580 -0.253726 0.073965 0.073998 0.272898 0.272780 0.246306 0.246459 -0.013528 0.026100 -0.013533 0.026160
polarizability: 1.61498972e+02 1.46076305e-02 1.24805227e+02 5.74094342e+00 -5.90977722e-02 1.05879660e+02
1716.lowfreq: -15.1904 -4.7784 -0.0005 -0.0003 0.0005 3.3783 18.2015 29.9433 37.9041
frequency: 18.1420 29.9251 37.6604 45.4701 63.1803 92.8384 93.8216 113.3184 125.0830 171.5942 181.9296 184.2774 194.2083 215.6418 231.2207 241.2509 269.3741 283.5600 306.5765 327.4330 339.6426 380.9172 383.4689 409.1160 418.9161 446.6810 471.3064 486.9086 553.1830 583.0899 677.4617 760.2667 763.5752 767.2855 796.7328 841.1825 876.5989 894.4246 910.7822 929.0934 929.3050 944.7903 945.6600 973.5909 1025.1474 1048.9223 1096.5537 1100.5478 1157.5710 1158.4319 1165.0817 1180.4213 1183.8815 1195.4532 1215.2347 1249.4335 1263.4169 1313.7105 1324.8062 1326.0101 1333.7957 1334.3394 1368.9640 1384.7851 1386.3689 1387.9324 1401.1666 1401.2503 1457.2541 1457.4121 1464.6348 1464.7161 1471.2801 1471.4017 1485.9513 1486.0770 1619.1389 1619.3213 2992.6566 2992.7570 2995.5998 2995.6918 3029.7638 3029.8415 3037.6457 3049.1555 3088.3151 3088.4241 3095.6577 3095.8442 3100.8870 3100.9151 3109.1567 3109.2216 3459.6376 3462.6644
redmass: 3.6668 3.1689 2.9969 4.2296 4.6844 6.7602 7.8070 4.3167 4.8592 3.1805 1.0890 1.0702 2.1175 4.5016 1.2057 1.6214 2.4776 2.0737 3.0613 5.1329 1.8530 3.3694 4.1723 2.7747 2.4862 1.2811 2.9457 3.2129 9.5144 5.7208 5.1666 7.0348 4.1670 4.4422 6.1625 5.0869 3.6276 2.5992 3.4495 1.1946 1.1933 1.3949 1.4099 3.1562 5.0373 4.7618 1.7170 1.6812 2.0957 2.0468 1.8575 2.2445 1.7440 2.1812 1.9297 1.6755 1.2903 1.3772 1.2894 1.2886 1.5014 1.5008 1.2771 1.3428 1.2535 1.3713 1.2264 1.2266 1.0541 1.0539 1.0466 1.0467 1.0492 1.0492 1.0491 1.0492 10.2073 10.2038 1.0358 1.0358 1.0362 1.0361 1.0869 1.0869 1.0834 1.0855 1.0994 1.0994 1.0988 1.0988 1.1006 1.1006 1.1008 1.1008 1.0649 1.0647
irintensity: 0.5908 0.6280 3.2748 0.1480 0.1579 0.7452 9.7179 0.1507 0.0094 1.2893 0.0996 0.0726 0.3526 2.2187 0.8348 0.5860 89.0257 29.1607 11.7656 8.7132 133.4174 25.0646 13.4196 9.3233 1.8123 13.4803 6.4614 0.0549 22.0689 30.9918 8.4767 6.5334 32.3245 2.3145 13.6908 9.6833 14.6775 0.7953 23.7950 2.5357 2.4542 0.0276 0.5841 0.7296 184.9678 160.2389 271.5905 13.1907 26.6529 14.8555 147.8893 62.1362 38.3567 66.2764 437.8974 81.1982 0.1770 5.6686 0.4829 4.6677 3.5192 3.8292 22.7445 0.0817 14.4555 93.3970 27.0547 13.7531 5.4108 6.8431 4.4521 1.6753 12.8243 6.4501 31.7246 15.7699 128.2601 209.9984 11.4351 12.8706 28.1171 10.9077 8.1634 5.3822 2.6543 24.2245 2.4854 2.0697 88.7581 11.8928 6.8575 43.2815 21.6463 22.0784 74.2674 25.3961
temp: 298.150 k
press: 1.00000 atm
elementType: 8 8 8 8 8 8 6 6 6 6 6 6 6 6 6 6 1 1 1 1 1 1 1 1 1 1 1 1 1 1 1 1 1 1
symmnumber: 1
zpe: 721017.6 jmol-1
zpe.correction: 0.274621 hartree
zpe.thermalcorrener: 0.294312 hartree
zpe.thermalcorrenthalpy: 0.295256 hartree
zpe.thermalcorrgfe: 0.224629 hartree
zpe.sumelectzpe: -841.922448 hartree
zpe.sumelectthermal: -841.902758 hartree
zpe.sumelectthermalent: -841.901814 hartree
zpe.sumelectthermalfe: -841.972441 hartree
dipole: -0.0144 3.5903 0.0176
dipole: 3.5904
quadrupole: -73.8323 -97.1299 -100.5402
quadrupole: 0.0041 2.8977 -0.0449
quadrupole: 16.6685 -6.6291 -10.0394 0.0041 2.8977 -0.0449
hfenergy: -842.1970694 hartree
pointgroup: C01 [X(C10H18O6)]
dipole: -0.0010959 -1.4113837 0.0578619 debye
polarizability: 160.5755867|-0.3085713|124.7598825|-9.1300861|-0.910011|106.8483901 unknown
InChI: InChI=1S/C10H18O6/c1-5(2)15-9(13)7(11)8(12)10(14)16-6(3)4/h5-8,11-12H,1-4H3
charge 0 multiplicity 1
34 atoms
O  2.388164 -0.672996 0.096721
O  -2.374975 -0.702041 -0.137307
O  -0.278511 1.481818 1.369617
O  0.280109 1.336054 -1.610127
O  2.414521 1.469851 1.037559
O  -2.413045 1.339022 -1.282452
C  0.275258 0.340612 0.665741
C  -0.267704 0.266105 -0.797522
C  3.892175 -0.634653 -0.12503
C  -3.880474 -0.655802 0.071112
C  1.804635 0.45021 0.629889
C  -1.79749 0.368428 -0.775674
C  4.330847 -2.098622 -0.137072
C  4.164316 0.12442 -1.429547
C  -4.305527 -2.114928 0.232647
C  -4.16841 0.230476 1.289197
H  -0.025169 -0.581202 1.194683
H  0.039289 -0.701867 -1.231842
H  4.320922 -0.087735 0.735293
H  -4.308719 -0.205054 -0.84351
H  5.425981 -2.157616 -0.271937
H  4.069034 -2.598561 0.810944
H  3.848753 -2.644331 -0.966938
H  5.253794 0.173218 -1.61046
H  3.774925 1.154238 -1.374696
H  3.689624 -0.387319 -2.284754
H  -5.40128 -2.170892 0.363423
H  -4.029956 -2.708688 -0.655494
H  -3.826436 -2.565622 1.119323
H  -5.259278 0.283928 1.459947
H  -3.791531 1.254171 1.13062
H  -3.691848 -0.184997 2.194156
H  0.439759 2.171897 1.424543
H  -0.445254 2.007978 -1.743054
