program: Gaussian 09
title: 000112961
version: EM64L-G09RevD.01
frameworkgroup: C1[X(C8H14NO)]
method: RPBEPBE
basis: SDD
operation: Freq
keyword: #p
keyword: freq=noraman
keyword: PBEPBE/SDD
title: #p freq=noraman PBEPBE/SDD
converged: NO YES NO NO
title: Mulliken charges:
elementType: O N C C C C C C C C H H H H H H H H H H H H H H
charge: -0.138822 -0.002933 0.204021 -0.638940 -0.638420 -0.661648 -0.075011 0.393625 -0.374145 -0.728344 0.258335 0.222068 0.244820 0.222306 0.258173 0.244678 0.247622 0.241199 0.241301 0.323754 0.313908 0.273683 0.284381 0.284388
chargesum: 1.00000
title: Mulliken charges with hydrogens summed into heavy atoms:
elementType: O N C C C C C C C C
charge: -0.138822 -0.002933 0.204021 0.086283 0.086737 0.068475 0.248743 0.393625 -0.060237 0.114109
polarizability: 1.23654954e+02 -3.61683023e+00 9.20788941e+01 1.61322050e-03 1.36170685e-04 6.68415138e+01
1716.lowfreq: -36.9822 -0.0005 -0.0004 0.0001 3.6339 7.0249 10.1224 50.8797 116.9071
frequency: -36.1772 50.7849 116.8867 167.0423 182.7510 231.5053 242.0452 265.0205 279.6413 324.3221 334.6193 356.8159 419.0947 469.3715 525.4946 587.5651 618.8922 655.9336 790.7234 829.1179 884.2481 914.7607 917.9385 922.4209 928.0883 961.8376 980.2640 1005.4528 1029.4076 1038.4121 1044.8450 1097.1029 1170.9664 1194.9948 1212.8726 1229.0587 1252.5179 1367.6850 1388.8266 1394.1652 1409.4841 1420.3743 1445.8568 1454.2824 1454.5753 1456.9621 1460.1308 1475.3764 1481.3380 1481.5077 1492.0993 1574.0251 2998.0803 3000.2921 3002.9239 3012.1632 3084.6396 3096.4091 3101.5389 3109.0192 3111.0772 3118.3622 3118.8001 3129.7273 3235.7691 3265.7607
redmass: 3.2522 1.0263 3.3762 2.8409 1.0501 3.1156 1.0606 1.0515 2.7025 2.5662 2.8311 2.6943 2.8993 3.1580 2.7480 5.4870 3.1900 4.5850 3.1252 1.1972 6.6084 1.5642 1.5027 3.8745 1.6605 1.2044 2.7362 1.8870 1.4090 1.4214 1.5248 1.7854 2.0588 4.4040 1.5769 3.0072 2.6068 3.4791 1.1749 1.2048 1.2064 1.2044 1.0404 1.1147 1.0481 1.0456 1.0500 2.1663 1.3896 1.0582 1.1092 5.5379 1.0361 1.0364 1.0384 1.0364 1.0977 1.1008 1.1003 1.1014 1.1014 1.0997 1.1018 1.0991 1.0981 1.1048
irintensity: 0.4211 0.4311 4.9380 0.2410 0.2930 5.3807 0.0268 0.2020 0.5714 0.0787 0.3529 3.0398 0.2596 1.1552 6.6963 5.5729 0.5477 1.8607 0.1354 55.2078 1.9349 0.2764 1.8031 15.4671 3.8786 0.2262 0.4451 8.6196 0.9949 1.8108 10.2663 15.8511 85.2851 12.2777 36.7016 14.5791 15.5299 3.4621 23.0716 28.8166 34.9673 8.9111 26.9632 36.1734 0.2421 0.4280 0.2965 50.5426 77.6650 21.1976 13.6780 90.7542 6.0547 8.0555 3.7753 1.9272 0.0232 0.5913 28.3671 5.5003 0.3390 16.2972 16.4734 0.6424 7.9142 16.6665
temp: 298.150 k
press: 1.00000 atm
elementType: 8 7 6 6 6 6 6 6 6 6 1 1 1 1 1 1 1 1 1 1 1 1 1 1
symmnumber: 1
zpe: 540557.0 jmol-1
zpe.correction: 0.205887 hartree
zpe.thermalcorrener: 0.216518 hartree
zpe.thermalcorrenthalpy: 0.217462 hartree
zpe.thermalcorrgfe: 0.170363 hartree
zpe.sumelectzpe: -442.156494 hartree
zpe.sumelectthermal: -442.145864 hartree
zpe.sumelectthermalent: -442.144920 hartree
zpe.sumelectthermalfe: -442.192019 hartree
dipole: -1.7862 -1.6382 0.0004
dipole: 2.4237
quadrupole: -28.6397 -47.9896 -57.5203
quadrupole: 0.0191 -0.0033 0.0007
quadrupole: 16.0768 -3.2731 -12.8038 0.0191 -0.0033 0.0007
hfenergy: -442.3623817 hartree
pointgroup: C01 [X(C8H14N1O1)]
dipole: -0.7270222 0.617034 0.0004592 debye
dipolederiv: -0.4140658 0.0943114 -0.0008167 0.1279428 -0.3800287 -0.0006497 0.000061 -0.0008076 -0.0559344 -0.3832601 -0.0345636 0.0004738 0.4741174 0.0180978 0.0006153 -0.0009617 0.0007861 -0.107326 0.831497 -0.0716868 -0.000491 -0.2972448 0.2302059 0.0000135 0.0015898 -0.000621 0.3003338 -0.1481331 0.0107601 -0.008545 0.085222 0.0135876 -0.0355127 0.0665983 -0.0443591 -0.036077 -0.1483227 0.0111799 0.0083866 0.084493 0.0140889 0.0350483 -0.0676962 0.0440757 -0.0369553 -0.0747681 -0.0038933 0.0001773 0.0063926 -0.0608951 0.00021 -0.0001931 0.0003212 0.021287 0.5498129 0.1748928 0.0003355 -0.2565785 0.0734993 0.000001 0.0005121 0.000371 0.0517387 0.6554996 0.1683344 0.000921 0.48503 0.707833 0.0006742 0.0009694 0.0009812 0.0879729 -0.4612415 -0.2826351 -0.0003068 -0.4884907 -0.3160467 -0.0002226 -0.001041 -0.0004993 -0.1596065 -0.1925709 -0.0900466 -0.0002847 -0.2656127 -0.1908799 -0.0003525 -0.0004865 -0.000278 0.0097522 -0.0639263 0.0450589 0.0035319 0.0384181 0.1050542 -0.0153735 -0.013321 -0.0164089 0.0984149 0.114325 0.0522687 -0.013738 0.018965 -0.1250704 -0.0161729 -0.0195751 0.0326663 0.0646092 0.0730898 -0.0492557 0.0872644 -0.0570436 0.0616179 0.0616303 0.0530599 0.0325022 -0.0404955 0.1140924 0.0521748 0.0134019 0.0192224 -0.1249315 0.0178473 0.0193363 -0.0312476 0.0646839 -0.064306 0.0451013 -0.0034711 0.0382877 0.1053017 0.0152897 0.0137016 0.0161731 0.0980982 0.0727477 -0.0502352 -0.0870818 -0.0576398 0.0607411 -0.0625595 -0.0528791 -0.033175 -0.0392462 -0.0781094 0.0372555 0.0001098 0.0125537 0.1030059 0.0001016 0.0002229 0.0001207 0.1237992 0.0873712 -0.0520669 0.0812924 -0.0216472 0.051415 0.0308368 0.0815856 0.0528945 -0.0383962 0.0871542 -0.0529794 -0.0810898 -0.0224723 0.0508973 -0.0314302 -0.0816605 -0.0533767 -0.0370409 0.1195814 -0.0390323 -0.0000506 -0.0373478 0.1803437 -0.0000422 0.000107 -0.0000882 0.1843548 0.1110164 0.0173556 -0.0000538 0.0083725 0.1480194 -0.0000529 -0.0000775 -0.0001164 0.2053455 0.043725 0.0355837 -0.0000305 0.0702516 0.0334163 -0.0001342 0.0000345 -0.0001313 0.1509343 0.0843464 -0.0089568 0.0464484 0.0174057 0.1205485 -0.0593419 0.0245241 -0.0663324 0.0447348 0.084445 -0.0089253 -0.0463834 0.017403 0.120179 0.0595771 -0.0244109 0.0665495 0.0450187 unknown
polarizability: 123.3303604|4.8192064|92.4034108|0.0312875|0.0412632|66.8415903 unknown
InChI: InChI=1S/C8H14NO/c1-7-5-6-9(10-7)8(2,3)4/h5-6H,1-4H3
charge 1 multiplicity 1
24 atoms
O  -0.771356 -0.771002 -0.000534
N  0.214643 0.272284 0.001705
C  1.691448 -0.125941 0.001006
C  2.320405 0.482779 1.281449
C  2.316562 0.471729 -1.286528
C  1.792773 -1.665827 0.007487
C  -0.422776 1.458564 0.00272
C  -2.025885 -0.130919 -0.000582
C  -1.827696 1.249488 0.001426
C  -3.215412 -1.022666 -0.002596
H  3.390608 0.217139 1.304365
H  2.252881 1.584807 1.295619
H  1.848495 0.08057 2.193677
H  2.248176 1.573532 -1.310157
H  3.386841 0.206438 -1.310225
H  1.8422 0.061249 -2.193797
H  2.863685 -1.928718 0.007195
H  1.334696 -2.107324 0.907492
H  1.33241 -2.115052 -0.887491
H  0.134312 2.393855 0.004315
H  -2.595478 2.017687 0.001955
H  -4.135017 -0.418193 -0.002282
H  -3.224515 -1.675038 -0.894098
H  -3.225602 -1.677642 0.886979
