program: Gaussian 09
title: 000112944
version: EM64L-G09RevD.01
frameworkgroup: C1[X(C11H16N3O3S)]
method: RPBEPBE
basis: SDD
operation: Freq
keyword: #p
keyword: freq=noraman
keyword: PBEPBE/SDD
title: #p freq=noraman PBEPBE/SDD
converged: YES YES NO NO
title: Mulliken charges:
elementType: S O O O N N N C C C C C C C C C C C H H H H H H H H H H H H H H H H
charge: 0.935470 -0.502176 -0.485577 -0.232640 -0.472328 0.033656 0.162139 -0.369483 -0.426678 -0.328702 -0.018225 -0.676082 -0.325533 -0.171920 0.299816 -0.265288 0.237751 -0.518147 0.225347 0.207845 0.268255 0.263822 0.196268 0.224147 0.329550 0.214728 0.232537 0.211127 0.336372 0.308645 0.298243 0.261043 0.259297 0.286719
chargesum: 1.00000
title: Mulliken charges with hydrogens summed into heavy atoms:
elementType: S O O O N N N C C C C C C C C C C C
charge: 0.935470 -0.502176 -0.485577 -0.232640 -0.142778 0.033656 0.162139 0.063710 0.105399 0.091713 -0.018225 -0.017689 0.010839 0.136724 0.299816 0.032955 0.237751 0.288912
polarizability: 3.03209310e+02 2.37515131e+01 1.91995577e+02 -1.97414940e+00 -2.72603700e+00 1.17272931e+02
1716.lowfreq: -10.9654 -6.3101 0.0010 0.0013 0.0015 0.9394 19.9823 28.2770 31.1704
frequency: 19.6005 28.2553 31.0090 65.1059 78.4204 90.0410 98.2514 115.4883 123.6263 128.4467 167.0006 184.6555 189.0506 208.9139 213.9306 225.1297 228.2903 264.4355 299.4665 319.2289 344.4269 356.2615 390.1140 396.3247 414.2903 438.2352 464.7329 497.6207 504.4296 587.9463 595.2675 617.3800 717.7279 737.6732 738.4512 781.8656 802.3889 812.5754 826.1284 836.1295 846.2935 914.6049 923.4776 935.3755 941.8955 966.0890 984.6424 1025.5478 1056.2213 1070.2758 1107.0977 1110.3255 1121.7004 1132.2399 1149.5779 1186.5460 1211.9815 1241.3885 1243.6267 1280.5807 1286.4890 1306.7490 1312.3740 1359.1380 1370.9031 1371.0632 1396.7513 1397.1969 1427.8168 1436.6388 1456.1500 1458.8942 1471.0688 1472.0465 1474.5671 1479.6058 1487.0202 1547.3841 1586.9865 2093.1874 2964.2444 2969.7364 2982.0278 2991.4792 3007.8253 3016.2789 3038.0217 3052.9647 3077.2458 3088.5050 3120.4896 3148.7415 3156.2035 3172.1869 3188.7320 3333.7697
redmass: 4.0557 5.9085 4.8472 4.4729 1.6055 4.7952 4.9494 3.5657 4.6436 5.9881 4.0872 1.3624 3.3806 6.7266 6.2813 1.1479 4.2577 2.9020 3.9992 4.6300 4.0929 5.2994 4.3772 6.8985 7.1205 7.7517 5.5795 2.6360 3.4287 5.3540 6.0432 7.2699 5.2891 3.5365 1.1366 6.6969 2.2096 2.2504 7.1674 1.4843 1.4428 1.7379 2.5751 1.7710 8.3691 1.8294 1.4053 3.6269 2.0692 2.4051 2.1430 1.2469 1.6211 2.5908 1.4758 1.6470 1.3288 1.2865 1.5381 2.1965 1.1958 1.1480 1.2433 1.5142 1.2274 3.8228 9.3679 1.2130 1.2960 1.0677 1.0801 1.0667 1.0490 2.2682 1.0484 1.0416 1.0889 6.7977 6.9137 13.9012 1.0618 1.0636 1.0363 1.0618 1.0304 1.0941 1.1014 1.1020 1.1008 1.0994 1.1075 1.0945 1.0919 1.1039 1.0949 1.0743
irintensity: 0.1891 1.8079 0.8228 0.3554 0.1433 1.1886 2.3908 1.4506 4.2283 4.5379 10.3571 2.7388 0.3528 2.3268 8.3042 0.4762 1.8884 8.1602 0.8800 9.6341 14.3426 12.0225 0.6670 7.1888 50.2480 27.5303 93.5704 7.7968 43.4350 12.1949 5.4752 2.0470 4.8657 2.5325 13.4585 94.3686 2.1564 81.9641 24.6216 35.8761 4.1500 11.1425 25.7193 7.8165 71.4541 9.6366 0.9165 8.8905 24.2380 1.8452 4.2256 0.1380 36.5180 26.8422 11.5168 61.8692 2.2179 5.7078 36.5565 149.6954 3.8363 5.3296 3.2020 3.7508 12.7457 14.6165 21.4993 12.0182 51.0946 21.1651 4.3694 43.4330 26.5656 164.7617 5.9525 14.6257 16.0064 58.0763 198.8320 462.0002 10.0153 51.6662 42.1090 10.8710 13.5802 4.8137 15.1991 5.4353 53.2712 28.8138 10.6357 21.0547 4.9719 1.9008 2.9686 31.3767
temp: 298.150 k
press: 1.00000 atm
elementType: 16 8 8 8 7 7 7 6 6 6 6 6 6 6 6 6 6 6 1 1 1 1 1 1 1 1 1 1 1 1 1 1 1 1
symmnumber: 1
zpe: 687184.6 jmol-1
zpe.correction: 0.261735 hartree
zpe.thermalcorrener: 0.282095 hartree
zpe.thermalcorrenthalpy: 0.283039 hartree
zpe.thermalcorrgfe: 0.210796 hartree
zpe.sumelectzpe: -1214.889502 hartree
zpe.sumelectthermal: -1214.869142 hartree
zpe.sumelectthermalent: -1214.868198 hartree
zpe.sumelectthermalfe: -1214.940441 hartree
dipole: 11.9792 -0.6888 3.9532
dipole: 12.6334
quadrupole: -29.0181 -93.5602 -114.2357
quadrupole: -9.6935 -7.1191 -3.9337
quadrupole: 49.9199 -14.6222 -35.2977 -9.6935 -7.1191 -3.9337
hfenergy: -1215.1512372 hartree
pointgroup: C01 [X(C11H16N3O3S1)]
dipole: 4.8348874 -0.1526064 -1.142362 debye
polarizability: 301.7346734|-12.1759832|175.8075606|26.7680789|-30.1061521|134.9355844 unknown
InChI: InChI=1S/C11H16N3O3S/c1-3-4-7-13-18(15,16)9-5-6-11(17-2)10(8-9)14-12/h5-6,8,13H,3-4,7H2,1-2H3
charge 1 multiplicity 1
34 atoms
S  -1.470848 0.222784 0.30738
O  -1.769414 -0.850219 1.495162
O  -1.841887 1.809854 0.35368
O  4.609247 0.206242 0.105124
N  -1.958154 -0.52443 -1.33493
N  3.288464 -1.756616 1.313548
N  3.92803 -2.587748 1.810127
C  -4.427045 -1.247239 -1.266074
C  -2.93949 -1.655182 -1.235057
C  -4.901239 -0.413407 -0.052182
C  0.430845 0.208266 0.165758
C  -6.419846 -0.137776 -0.099632
C  1.11361 -0.832828 0.77535
C  1.083553 1.293735 -0.469269
C  2.541587 -0.77505 0.72392
C  2.48859 1.340002 -0.523211
C  3.253178 0.303281 0.068641
C  5.454333 1.263004 -0.522397
H  -5.021041 -2.181808 -1.313733
H  -4.643501 -0.699855 -2.207564
H  -2.689827 -2.310161 -2.092623
H  -2.707116 -2.219195 -0.311301
H  -4.36464 0.557861 -0.015326
H  -4.645544 -0.947913 0.883443
H  -2.340494 0.283276 -1.870211
H  -6.995653 -1.081655 -0.086672
H  -6.740585 0.464615 0.768155
H  -6.699692 0.415203 -1.015706
H  0.574903 -1.634256 1.29467
H  0.484857 2.110287 -0.888732
H  2.987035 2.179412 -1.013576
H  5.274237 2.231037 -0.025268
H  5.24581 1.316455 -1.604157
H  6.483237 0.925923 -0.345536
