program: Gaussian 09
title: 000112895
version: EM64L-G09RevD.01
frameworkgroup: C1[X(C18H14N2O2)]
method: RPBEPBE
basis: SDD
operation: Freq
keyword: #p
keyword: freq=noraman
keyword: PBEPBE/SDD
title: #p freq=noraman PBEPBE/SDD
converged: YES YES NO NO
title: Mulliken charges:
elementType: O O N N C C C C C C C C C C C C C C C C C C H H H H H H H H H H H H H H
charge: -0.296055 -0.185642 -0.087811 -0.123693 0.192921 0.453571 0.150470 0.033507 -0.445715 -0.359222 -0.424982 -0.301039 -0.238870 -0.234100 0.184101 0.254979 -0.283468 -0.343463 -0.200421 -0.202980 -0.752568 -0.236117 0.239822 0.259305 0.245409 0.279044 0.231974 0.231123 0.262597 0.251487 0.228091 0.231896 0.246074 0.250761 0.257639 0.231375
chargesum: 0.00000
title: Mulliken charges with hydrogens summed into heavy atoms:
elementType: O O N N C C C C C C C C C C C C C C C C C C
charge: -0.296055 -0.185642 -0.087811 -0.123693 0.192921 0.453571 0.150470 0.033507 -0.205893 -0.099917 -0.179573 -0.021995 -0.006896 -0.002977 0.184101 0.254979 -0.020871 -0.091976 0.027671 0.028915 0.001906 -0.004742
polarizability: 4.97337650e+02 -6.23112658e+00 2.25317266e+02 2.56350410e+00 -1.09992960e+01 9.71139083e+01
1716.lowfreq: -8.9369 -0.0006 0.0004 0.0007 2.9508 5.9847 14.1916 35.0337 44.0134
frequency: 13.0768 35.0195 43.9777 60.0416 65.5157 83.4657 100.6755 103.6399 154.0604 176.2310 197.0718 227.1992 245.9453 268.5922 277.5700 327.3789 363.4863 406.5446 418.5881 425.2143 482.1457 488.8984 497.4249 527.3482 531.7316 543.3170 547.7326 578.0827 609.6516 631.2177 642.1714 680.4264 691.2758 723.0103 754.4337 764.9967 780.6057 784.1047 809.0477 843.6834 848.8999 874.3919 882.0943 892.4424 938.4805 946.6069 968.0891 982.0420 983.8037 986.7258 993.1292 998.6208 999.2149 1015.2392 1027.6018 1034.8067 1059.0509 1076.9766 1140.4848 1147.1646 1151.3714 1169.0481 1170.7329 1177.5306 1192.5518 1231.5354 1237.2995 1267.3474 1305.4126 1344.1256 1361.9180 1381.6694 1389.7375 1408.0796 1419.4851 1440.0156 1444.1348 1446.2627 1451.4135 1453.8767 1466.0073 1504.8417 1571.6374 1582.2930 1598.4688 1601.8156 1631.8570 1695.6034 3007.0314 3096.3168 3126.2948 3128.8059 3132.9576 3139.9736 3140.2954 3143.8983 3153.8687 3157.0478 3167.2000 3172.2675 3173.2800 3174.5043
redmass: 3.8166 5.5230 4.5066 6.1636 4.4036 4.5845 5.6121 1.0908 4.9133 5.2783 6.0333 6.1695 5.7951 6.2726 5.9839 3.8711 5.1631 2.8887 3.3527 5.5832 6.1961 6.0518 3.4357 3.4278 5.4179 3.8640 3.9871 5.3082 6.5682 6.6175 5.2335 4.0376 1.8898 5.3368 6.3152 1.3130 2.3308 3.0906 3.2961 1.5005 1.2552 5.5121 6.8010 1.6953 1.5150 5.5728 1.3701 2.2621 1.5214 3.9055 1.3342 1.3480 1.3400 2.0692 2.1722 1.6472 3.6224 1.4994 2.0012 1.3399 1.7869 1.3412 1.0659 1.4210 2.3279 2.0360 3.0006 1.7818 1.4067 4.7875 3.6542 1.2525 8.7563 4.5509 2.7533 4.3166 2.6680 2.5806 1.0694 1.0596 2.3004 3.7745 8.2741 6.2422 6.0693 6.2449 7.1067 10.5452 1.0373 1.0961 1.0866 1.0852 1.0893 1.0889 1.0896 1.1016 1.0933 1.0949 1.0967 1.0988 1.0949 1.0982
irintensity: 0.0835 0.5290 0.4283 0.8093 6.7470 1.6885 0.1903 0.2194 1.4524 0.6496 1.6688 0.7009 1.4602 2.5605 0.6271 3.3889 0.1130 0.2455 6.1316 10.2616 6.1722 3.0548 4.3191 4.6649 7.4409 8.5684 3.1800 19.2952 0.6850 1.9395 7.0043 3.2947 43.6178 21.7365 2.2747 74.4199 15.8650 53.0680 2.1559 59.8961 2.5029 20.7562 0.5507 11.9637 4.7407 23.1551 3.2071 69.4833 5.3683 2.6108 0.0290 0.1513 0.1390 10.3680 7.1606 6.4284 95.7696 24.1367 180.7637 50.9519 98.1987 8.3838 0.7632 30.6766 12.9043 35.1432 19.2229 10.9814 0.9465 40.0896 29.2772 51.7865 3.4586 0.9335 4.8435 4.8836 7.3160 12.6590 22.1498 25.0037 4.7381 11.1101 13.0557 2.7902 8.8565 6.8283 30.9222 161.4171 1.4642 7.5569 0.9062 1.9049 8.9370 9.3818 13.7048 8.5165 24.1828 28.5516 27.0203 28.0421 19.3419 20.9114
temp: 298.150 k
press: 1.00000 atm
elementType: 8 8 7 7 6 6 6 6 6 6 6 6 6 6 6 6 6 6 6 6 6 6 1 1 1 1 1 1 1 1 1 1 1 1 1 1
symmnumber: 1
zpe: 716026.5 jmol-1
zpe.correction: 0.272720 hartree
zpe.thermalcorrener: 0.291345 hartree
zpe.thermalcorrenthalpy: 0.292289 hartree
zpe.thermalcorrgfe: 0.223427 hartree
zpe.sumelectzpe: -952.724246 hartree
zpe.sumelectthermal: -952.705622 hartree
zpe.sumelectthermalent: -952.704678 hartree
zpe.sumelectthermalfe: -952.773540 hartree
dipole: -0.1938 0.4655 -1.6284
dipole: 1.7047
quadrupole: -94.5493 -106.0172 -138.8177
quadrupole: 2.6440 -0.9639 -5.9951
quadrupole: 18.5788 7.1108 -25.6896 2.6440 -0.9639 -5.9951
hfenergy: -952.9969665 hartree
pointgroup: C01 [X(C18H14N2O2)]
dipole: -0.0812261 0.4377396 -0.5015861 debye
polarizability: 497.4875709|-1.1474527|210.2426361|1.90757|42.5327742|112.0386176 unknown
InChI: InChI=1S/C18H14N2O2/c1-13(21)22-18-16-10-6-5-7-14(16)11-12-17(18)20-19-15-8-3-2-4-9-15/h2-12H,1H3
charge 0 multiplicity 1
36 atoms
O  -1.068661 1.745302 0.222868
O  -0.105605 1.257922 2.31504
N  0.977204 -0.070743 -0.235308
N  1.884769 -0.980537 -0.491798
C  -2.771381 0.059127 -0.198234
C  -3.116371 -1.291332 -0.592472
C  -1.384741 0.398989 -0.083861
C  -0.364117 -0.53701 -0.351375
C  -2.064893 -2.238647 -0.849081
C  -3.814748 1.005653 0.064547
C  -4.49836 -1.641573 -0.708613
C  -0.730874 -1.876491 -0.732079
C  -5.155176 0.630218 -0.056743
C  -5.500587 -0.701795 -0.446288
C  3.237306 -0.531644 -0.357554
C  -0.299255 2.059245 1.38969
C  3.631388 0.732032 0.168879
C  4.224633 -1.465326 -0.771516
C  4.998627 1.049131 0.264027
C  5.593085 -1.137248 -0.678281
C  0.1678 3.490505 1.287984
C  5.983825 0.120417 -0.161031
H  -2.337376 -3.259495 -1.140853
H  -3.541085 2.023975 0.355583
H  -4.760869 -2.663503 -1.006215
H  0.081821 -2.581925 -0.925948
H  -5.948749 1.357273 0.146166
H  -6.555422 -0.982765 -0.537618
H  2.856642 1.428622 0.502422
H  3.891298 -2.43287 -1.161172
H  5.306979 2.0171 0.675045
H  6.351726 -1.85792 -1.001903
H  0.595544 3.815506 2.247201
H  -0.666211 4.150928 0.997735
H  0.933815 3.56381 0.495031
H  7.04652 0.37537 -0.081774
