program: Gaussian 09
title: 000112878
version: EM64L-G09RevD.01
frameworkgroup: C1[X(C20H16N4O10S3)]
method: RPBEPBE
basis: SDD
operation: Freq
keyword: #p
keyword: freq=noraman
keyword: PBEPBE/SDD
title: #p freq=noraman PBEPBE/SDD
converged: YES YES NO NO
title: Mulliken charges:
elementType: S S S O O O O O O O O O O N N N N C C C C C C C C C C C C C C C C C C C C H H H H H H H H H H H H H H H H
charge: 0.972450 0.968851 0.992231 -0.185101 -0.560533 -0.560255 -0.486297 -0.489082 -0.490259 -0.483162 -0.567386 -0.502031 -0.504045 -0.278847 -0.027230 -0.040935 -0.054236 0.538029 0.526218 -0.437944 -0.262117 -0.254418 -0.455748 0.242098 0.149063 0.186767 -0.436075 -0.376305 0.451031 -0.271648 -0.239536 -0.760988 -0.322060 -0.361155 -0.081358 -0.222279 -0.206280 0.299299 0.324327 0.321644 0.293072 0.304378 0.257413 0.244159 0.257148 0.257452 0.310282 0.294591 0.283402 0.284527 0.388246 0.387927 0.382705
chargesum: 0.00000
title: Mulliken charges with hydrogens summed into heavy atoms:
elementType: S S S O O O O O O O O O O N N N N C C C C C C C C C C C C C C C C C C C C
charge: 0.972450 0.968851 0.992231 -0.185101 -0.172287 -0.172328 -0.486297 -0.489082 -0.490259 -0.483162 -0.184682 -0.502031 -0.504045 -0.278847 -0.027230 -0.040935 -0.054236 0.538029 0.526218 -0.138646 -0.262117 -0.254418 -0.131421 0.242098 0.149063 0.186767 -0.114431 -0.083233 0.451031 0.032730 0.017877 -0.002229 -0.011777 -0.066564 -0.081358 0.061124 0.078247
chargesum: -0.00001
polarizability: 6.42384796e+02 -1.37814917e+01 3.56617363e+02 -1.55320089e+01 -7.59113674e+00 2.73714701e+02
1716.lowfreq: -3.5632 -0.0368 0.0010 0.0021 0.7072 4.6650 7.2770 10.0122 17.6718
frequency: 7.1607 9.9753 17.6244 27.2037 32.5305 34.4203 37.5222 44.5156 56.2452 64.7253 68.8506 88.0204 96.3159 106.2867 113.4577 120.1847 141.2480 154.5586 158.8193 164.4262 174.8149 175.7969 178.5801 180.7927 189.5367 191.3273 213.6474 217.5914 228.8504 248.7309 250.1814 262.1883 268.0186 272.2868 277.6180 294.3620 307.6123 311.9173 319.2437 324.3840 327.2807 334.2071 347.1090 366.3754 375.7791 391.2558 399.4911 408.7978 417.6138 419.3727 429.9566 464.6859 474.9708 510.9896 513.5489 519.9691 526.7904 539.3221 544.3221 555.1039 560.7839 570.0676 590.9089 601.7891 617.9449 644.5622 664.0337 679.6352 695.1609 714.8111 735.8861 742.1759 769.3580 790.8372 809.2833 833.6151 833.9150 836.9570 850.8353 851.4807 862.7898 880.6695 913.7616 929.1594 943.4247 946.0829 951.5131 962.9041 966.0796 966.2702 982.0155 986.5584 989.6025 990.9888 999.5964 1001.4388 1014.2640 1043.4402 1046.2812 1047.1319 1047.4700 1050.7761 1061.5180 1076.1572 1107.3234 1120.2750 1127.6962 1171.4907 1185.2307 1190.1290 1193.4543 1209.2039 1251.4297 1268.5635 1293.2413 1300.3307 1329.5754 1357.6377 1375.2864 1389.6317 1394.4027 1402.5937 1415.3274 1419.0084 1422.2116 1435.6301 1452.9984 1454.8805 1479.2720 1496.7492 1555.1026 1582.1179 1594.2698 1595.4071 1596.7134 1626.4300 1652.9075 2979.2045 2983.9667 3059.8174 3116.7556 3153.3504 3160.0426 3164.5457 3164.8560 3165.6459 3169.9887 3182.6494 3194.8394 3199.1577 3477.9725 3478.8765 3479.6638
redmass: 9.4774 9.8769 8.5783 9.5146 6.3575 8.7621 9.6522 9.2711 4.4430 7.3007 8.0648 8.3448 8.5558 6.2667 6.2738 6.9820 7.8102 6.2302 7.7767 1.2552 4.1773 1.5874 2.6600 3.4004 4.0355 3.6561 4.6076 3.7158 2.7748 4.8562 3.8463 5.9364 4.9373 3.3454 3.6330 5.8318 5.9356 6.8760 9.2371 9.0825 9.6895 9.0147 7.8085 6.0884 7.6473 5.7774 8.9858 6.1669 3.3766 8.6545 9.1099 8.4873 5.6043 6.0963 8.3311 4.3079 4.1069 7.5567 7.2880 8.9567 7.2474 4.7688 5.3933 5.7990 7.1274 5.9412 4.7837 6.1310 7.3153 8.2978 3.8385 6.6823 1.5706 6.6754 7.0027 12.6821 12.9845 9.3788 1.2495 2.4551 1.5287 4.9413 4.4745 4.0897 1.5117 1.4612 2.0810 5.3727 9.8269 16.5497 2.8584 1.4668 3.4544 3.3067 1.3521 1.3986 4.0076 3.7680 1.6416 1.5780 1.2187 1.1770 2.0918 2.1587 2.1532 3.7770 1.3456 1.6750 1.2502 1.2837 1.8461 1.7306 1.5999 1.9583 3.3805 1.2707 2.0413 3.3907 3.7961 8.7835 10.1629 1.4447 3.3084 3.8398 3.6897 2.8947 1.1056 1.0502 2.6164 4.1550 8.1940 6.8925 6.3949 6.0644 7.1104 7.4027 12.3198 1.0771 1.0420 1.0968 1.0988 1.0897 1.0926 1.0912 1.0915 1.0914 1.0924 1.0993 1.0953 1.0949 1.0662 1.0662 1.0661
irintensity: 0.2132 0.0040 0.4657 1.6931 1.4203 0.2402 0.7264 1.3449 0.6546 0.3321 0.9201 0.5910 1.5388 0.7130 2.0087 2.4589 1.9933 10.0492 1.6435 4.4781 2.9269 49.1175 23.7837 18.8677 5.0428 1.4976 15.2327 9.6703 53.0142 0.7046 19.0139 13.0656 11.2911 49.6171 39.1560 27.9576 55.5270 17.5569 19.0276 16.6525 8.3224 7.0961 9.7006 16.1212 85.9990 0.2885 27.6410 13.1589 1.8209 28.1679 93.9757 40.1307 33.9393 38.9449 35.9511 15.7524 24.4775 95.5116 73.8773 45.8896 173.3216 16.4315 8.4363 10.0907 0.5886 16.8286 8.1449 32.3185 13.0450 26.3582 2.1601 6.8085 25.3037 20.7358 19.1798 90.2938 104.5331 27.2302 0.4109 50.2040 72.2160 16.3715 24.2867 13.1528 21.3429 11.7542 62.1811 58.1130 55.1102 85.6998 38.5367 3.0856 3.2046 30.0446 0.5453 2.3830 12.8140 24.0708 14.0772 106.5530 57.3238 79.4192 100.4833 0.8102 33.0363 102.7426 20.1811 15.2274 33.4804 3.7098 5.4725 1.4696 13.8875 26.7162 332.1039 2.1743 8.8692 109.1922 1.0782 2.0149 9.3842 30.3234 19.7535 7.2800 3.3915 9.8873 19.7827 17.2858 222.1189 42.7836 1.4655 3.1494 1.6777 156.2942 65.5203 2.2423 150.9457 17.8400 7.3183 7.1484 7.9095 7.3903 15.1867 0.5363 5.6533 6.6140 8.6296 1.9734 4.5534 0.1240 45.3209 60.0707 43.0419
temp: 298.150 k
press: 1.00000 atm
elementType: 16 16 16 8 8 8 8 8 8 8 8 8 8 7 7 7 7 6 6 6 6 6 6 6 6 6 6 6 6 6 6 6 6 6 6 6 6 1 1 1 1 1 1 1 1 1 1 1 1 1 1 1 1
symmnumber: 1
zpe: 896782.4 jmol-1
zpe.correction: 0.341566 hartree
zpe.thermalcorrener: 0.379066 hartree
zpe.thermalcorrenthalpy: 0.380010 hartree
zpe.thermalcorrgfe: 0.266769 hartree
zpe.sumelectzpe: -2933.899081 hartree
zpe.sumelectthermal: -2933.861582 hartree
zpe.sumelectthermalent: -2933.860638 hartree
zpe.sumelectthermalfe: -2933.973878 hartree
dipole: 7.4048 -0.4125 6.4112
dipole: 9.8033
quadrupole: -273.7039 -243.0702 -238.8672
quadrupole: 3.7253 -1.0937 -12.7580
quadrupole: -21.8235 8.8103 13.0132 3.7253 -1.0937 -12.7580
hfenergy: -2934.2406478 hartree
pointgroup: C01 [X(C20H16N4O10S3)]
dipole: 3.1032362 -1.6693736 -1.568095 debye
polarizability: 620.082628|78.0352239|300.8078556|-32.6772983|-36.3817901|351.8263767 unknown
InChI: InChI=1S/C20H16N4O10S3/c1-11-19(20(25)24(23-11)13-5-7-14(8-6-13)35(26,27)28)22-21-12-9-16-15(18(10-12)37(32,33)34)3-2-4-17(16)36(29,30)31/h2-10,19,26,29,32H,1H3
charge 0 multiplicity 1
53 atoms
S  5.855707 2.902071 -2.09007
S  3.153182 -1.349229 2.919588
S  -8.380247 -0.925462 1.895142
O  -2.179394 1.624184 -0.389681
O  6.913835 1.486279 -2.6601
O  3.096252 -2.719508 1.66593
O  5.087741 3.556648 -3.351106
O  6.758443 3.836108 -1.124837
O  3.87526 -1.867793 4.268964
O  1.677814 -0.689574 2.999925
O  -7.723513 -1.721596 3.442666
O  -8.933616 0.547083 2.274664
O  -9.331372 -1.991269 1.13418
N  -3.063154 -0.521436 -0.98427
N  -2.666014 -1.632923 -1.808556
N  0.304874 -0.013293 -1.27457
N  1.129505 0.878249 -1.734167
C  3.991099 0.358654 0.727334
C  5.028577 1.163472 0.083733
C  -1.003604 0.049158 -1.970696
C  4.643887 1.810681 -1.133562
C  4.378154 -0.291012 1.943997
C  2.696366 0.247382 0.137929
C  -1.504946 -1.336552 -2.356367
C  2.405635 0.907692 -1.064252
C  -2.122373 0.532433 -0.998133
C  3.391484 1.714188 -1.711756
C  6.329524 1.261904 0.676054
C  -4.303733 -0.604398 -0.293351
C  5.638264 -0.205911 2.515341
C  6.62589 0.592255 1.86285
C  -0.772769 -2.286452 -3.247872
C  -4.725927 0.453779 0.558512
C  -5.114398 -1.757451 -0.477891
C  -6.73459 -0.801239 1.028438
C  -5.958841 0.350589 1.231049
C  -6.345379 -1.86144 0.193924
H  -0.958104 0.742954 -2.836139
H  1.909191 -0.339237 0.619954
H  3.141095 2.23742 -2.640452
H  7.092048 1.880221 0.195775
H  5.858887 -0.73701 3.447087
H  7.623063 0.674481 2.304674
H  -0.586289 -1.837021 -4.241202
H  -1.348173 -3.216157 -3.378934
H  0.214732 -2.533161 -2.814307
H  -4.09811 1.336623 0.691321
H  -4.768821 -2.554184 -1.138453
H  -6.310898 1.154823 1.884065
H  -6.992351 -2.733704 0.060757
H  7.650964 1.862859 -3.224365
H  2.448759 -3.408172 1.997573
H  -8.496718 -1.848005 4.066761
