program: Gaussian 09
title: 000112849
version: EM64L-G09RevD.01
frameworkgroup: C1[X(C9H8N2O2)]
method: RPBEPBE
basis: SDD
operation: Freq
keyword: #pfreq=noraman
keyword: PBEPBE/SDD
title: #p freq=noraman PBEPBE/SDD
converged: YES YES NO NO
title: Mulliken charges:
elementType: O O N N C C C C C C C C C H H H H H H H H
charge: -0.217365 -0.220880 -0.032368 -0.436526 0.073955 0.340848 -0.400077 -0.367979 -0.348912 -0.238791 -0.223264 -0.230655 0.257774 0.250880 0.248832 0.217416 0.274500 0.231394 0.232649 0.234854 0.353713
chargesum: 0.00000
title: Mulliken charges with hydrogens summed into heavy atoms:
elementType: O O N N C C C C C C C C C
charge: -0.217365 -0.220880 -0.032368 -0.082812 0.073955 0.340848 0.099635 -0.150563 -0.074412 -0.007396 0.009386 0.004199 0.257774
polarizability: 2.13008935e+02 1.08203140e+01 1.11107744e+02 -1.87413516e+00 1.85701721e+00 5.19394732e+01
1716.lowfreq: -8.0298 -0.0008 -0.0008 0.0006 3.6289 10.9391 40.5098 56.5434 132.2589
frequency: 40.2456 56.5067 132.2540 148.5076 171.4510 281.8362 317.4968 374.2966 399.6246 439.5344 463.7788 526.6560 570.4217 588.0085 615.2995 663.8541 690.9096 694.7058 719.7625 766.8056 776.6820 849.9597 878.3893 928.7502 959.0055 967.5294 984.0779 988.2560 1006.0725 1023.0314 1052.7585 1080.7779 1121.4493 1159.6856 1175.3529 1191.6388 1213.6325 1311.9222 1319.5792 1372.5306 1382.9225 1420.7761 1437.0324 1456.4469 1491.2777 1557.6634 1588.5212 1612.5324 1686.8347 2976.2965 3114.8811 3129.9561 3137.5140 3149.8738 3163.1512 3173.5807 3582.1897
redmass: 4.5951 5.3748 6.0321 3.4062 4.7141 6.6263 6.0891 6.5419 2.8186 5.3375 5.0113 3.8960 8.0721 5.3228 6.4699 1.6340 3.8738 1.7973 4.2799 2.8196 2.9790 1.2576 4.9314 1.4501 5.5282 2.8989 1.3934 5.7134 1.3399 2.6518 2.4981 1.8957 3.7905 5.1632 1.0552 1.1183 1.1327 2.2200 1.4373 1.7399 7.5119 1.4015 2.2449 1.1003 2.4474 5.6688 6.2263 6.0423 8.1534 1.0684 1.0952 1.0850 1.0881 1.0931 1.0963 1.1000 1.0790
irintensity: 0.5898 2.7168 0.6697 7.8622 2.8663 1.7320 1.9619 4.3304 0.0274 0.7204 9.4696 5.4641 8.8480 23.3567 0.0624 45.2870 55.9621 87.1639 20.4598 17.2188 55.8280 0.5262 31.7335 2.5394 51.8409 5.0027 0.8474 0.7955 0.7338 2.9753 1.4587 36.1116 48.5094 222.3056 0.0220 4.2086 18.6970 32.0940 4.3895 9.7651 0.4226 0.1415 10.6507 12.4727 6.1511 18.2822 10.8850 0.7671 664.9470 26.7038 8.6802 3.0417 2.4591 28.1606 19.4552 15.2089 67.6136
temp: 298.150 k
press: 1.00000 atm
elementType: 8 8 7 7 6 6 6 6 6 6 6 6 6 1 1 1 1 1 1 1 1
symmnumber: 1
zpe: 413217.0 jmol-1
zpe.correction: 0.157386 hartree
zpe.thermalcorrener: 0.167803 hartree
zpe.thermalcorrenthalpy: 0.168748 hartree
zpe.thermalcorrgfe: 0.120218 hartree
zpe.sumelectzpe: -606.758565 hartree
zpe.sumelectthermal: -606.748148 hartree
zpe.sumelectthermalent: -606.747203 hartree
zpe.sumelectthermalfe: -606.795733 hartree
dipole: 4.9205 0.0403 1.4520
dipole: 5.1305
quadrupole: -88.1947 -66.1750 -77.8923
quadrupole: 5.8397 -5.8518 2.0954
quadrupole: -10.7740 11.2457 -0.4716 5.8397 -5.8518 2.0954
hfenergy: -606.915951 hartree
pointgroup: C01 [X(C9H8N2O2)]
dipole: -1.9223625 0.0687724 -0.6116093 debye
dipolederiv: -0.656853 0.2464764 -0.0239632 0.2144515 -0.6858799 0.0361932 0.0295918 -0.0945266 -0.3014262 -1.6538503 0.0784628 -0.1533313 -0.0239715 -0.4663278 -0.0036059 -0.2615813 -0.0218258 -0.3961265 0.7938443 -0.277145 -0.0384615 0.080868 -0.278235 -0.0519061 -0.0708613 0.0167479 -0.1452492 -1.5309962 0.1102756 -0.1011018 -0.9201906 -0.2627906 -0.0654065 -0.2861606 -0.1424102 -0.4403434 0.4290156 0.0608309 -0.074894 0.3336511 0.1093449 0.0066314 0.0834236 -0.0164503 -0.019664 0.0782181 -0.0444061 0.0026045 -0.1093803 -0.0413183 -0.0028863 -0.0629283 -0.0030984 -0.0006706 0.2659091 -0.0981224 0.0914622 -0.1240309 0.1611228 -0.0978964 0.0504172 -0.0767109 0.4328155 -0.0244418 0.0833504 -0.0135048 0.0151677 0.0152385 -0.0152577 -0.0235208 -0.0066232 -0.1582133 -0.1141564 -0.0874149 0.001737 -0.006016 0.0064317 -0.0044796 0.0161245 0.0037686 -0.125128 -0.0697263 -0.104506 0.0004067 -0.2177042 0.0798343 0.0045941 0.0224198 -0.0044122 -0.1485968 -0.0304184 0.1241582 -0.0073867 0.1648565 0.0961497 -0.0147433 -0.0142142 -0.0131449 -0.1451879 0.0357963 0.0019008 -0.0114308 0.0258079 -0.0343151 -0.0028997 -0.0078612 -0.0032939 -0.1518679 2.2289091 -0.1224368 0.2732849 0.6315028 1.0928977 0.2203078 0.5036974 0.2836357 0.4972977 0.0252222 -0.0252455 0.0177354 0.0156044 0.0430234 0.0275295 -0.0173068 0.1038369 -0.0918106 0.0424478 0.1017239 0.0253184 0.0794012 0.0130746 -0.0357448 0.0356765 -0.0548734 0.0557994 0.0485641 -0.1066397 0.0097108 -0.1022074 -0.0528002 0.0112703 -0.0008865 0.009545 0.1456559 0.0932174 0.0771127 -0.0024844 0.049399 0.0111108 0.0059925 -0.0032379 -0.0006907 0.1538423 0.017089 0.0812193 0.0027381 0.1104369 -0.0651394 0.0022148 0.0030685 0.0022972 0.1598436 0.0156703 -0.0810608 0.0073785 -0.1088589 -0.063801 0.0103472 0.0068713 0.0110776 0.1556635 -0.1276963 -0.0006766 0.0122695 -0.0021215 0.0936494 0.0023362 0.0096088 0.0018625 0.1622346 0.1342353 -0.0178572 -0.0180875 -0.1066657 0.2287297 -0.0325909 -0.0123406 0.005289 0.3611318 unknown
polarizability: 212.8863347|-11.4441773|111.2430569|0.9747733|1.9608215|51.92676 unknown
InChI: InChI=1S/C9H8N2O2/c12-9-11-10-8(6-13-9)7-4-2-1-3-5-7/h1-5,11H,6H2
charge 0 multiplicity 1
21 atoms
O  2.495509 1.104616 0.569856
O  4.424648 -0.179312 0.431251
N  0.990255 -1.149447 -0.247079
N  2.391205 -1.080471 -0.295357
C  0.362595 0.009398 -0.099658
C  -1.113596 0.011241 -0.023003
C  1.169704 1.297418 -0.08719
C  -1.853064 1.227173 -0.02372
C  -1.827286 -1.221681 0.037199
C  -3.263698 1.210857 0.03474
C  -3.2326 -1.23315 0.095174
C  -3.959873 -0.016644 0.095981
C  3.201596 -0.059329 0.227164
H  1.343797 1.655455 -1.122876
H  0.697421 2.097842 0.498557
H  -1.341579 2.194499 -0.078121
H  -1.257268 -2.155382 0.039321
H  -3.817234 2.156048 0.032395
H  -3.765952 -2.188765 0.144406
H  -5.05409 -0.027777 0.145341
H  2.845512 -1.97379 -0.484582
