program: Gaussian 09
title: 000112847
version: EM64L-G09RevD.01
frameworkgroup: C1[X(C13H7ClF3NO3)]
method: RPBEPBE
basis: SDD
operation: Freq
keyword: #p
keyword: freq=noraman
keyword: PBEPBE/SDD
title: #p freq=noraman PBEPBE/SDD
converged: YES YES NO NO
title: Mulliken charges:
elementType: Cl F F F O O O N C C C C C C C C C C C C C H H H H H H H
charge: 0.006182 -0.164102 -0.161193 -0.162911 -0.279058 -0.196047 -0.199034 0.023333 0.304489 0.487266 -0.331072 -0.332411 0.392160 -0.323999 -0.317098 -0.479949 0.266507 0.401095 -0.381916 -0.376885 -0.154663 0.290629 0.270430 0.278304 0.323887 0.274520 0.293101 0.248435
chargesum: 0.00000
title: Mulliken charges with hydrogens summed into heavy atoms:
elementType: Cl F F F O O O N C C C C C C C C C C C C C
charge: 0.006182 -0.164102 -0.161193 -0.162911 -0.279058 -0.196047 -0.199034 0.023333 0.304489 0.487266 -0.040444 -0.061980 0.392160 -0.323999 -0.038794 -0.156062 0.266507 0.401095 -0.107397 -0.083784 0.093773
polarizability: 2.45450723e+02 -1.95430706e+00 1.76536693e+02 -2.00336580e+01 4.34260045e+00 1.09321589e+02
1716.lowfreq: -7.0751 -2.7382 -0.0018 -0.0015 -0.0008 4.4328 10.9748 20.5904 27.3727
frequency: 10.8865 20.5445 27.3372 36.5294 60.3295 85.1794 136.5549 143.1822 163.8062 173.9367 197.3557 217.9439 245.1345 271.7470 313.0654 357.1951 376.5603 379.5971 420.3949 425.3991 430.0136 441.9725 476.7275 501.2400 518.6589 528.1558 584.7351 597.8616 624.4505 647.4603 663.7274 671.8763 700.1186 706.4693 732.9411 759.3261 812.2944 825.3641 829.7596 895.6823 912.3076 920.9020 936.8515 963.7097 986.3896 987.4780 994.9794 1021.0980 1029.7822 1045.2874 1074.3039 1081.0717 1159.6547 1166.7638 1182.6712 1214.8956 1238.0270 1251.5600 1279.5946 1291.3383 1372.3673 1377.2011 1397.2974 1402.8316 1438.8917 1466.0592 1485.5653 1575.4273 1590.7058 1605.4781 1619.7253 3159.2102 3160.6370 3177.6131 3179.4999 3180.0602 3181.4493 3194.2995
redmass: 18.0358 7.9925 9.2657 11.5210 11.3501 9.9200 14.4595 6.2408 7.0475 6.5320 9.4262 6.1996 9.4610 11.0490 9.9468 9.0730 9.1014 10.2731 8.1351 7.2787 3.3574 3.7025 8.1146 7.4734 6.0333 8.3009 9.2906 7.2010 5.4973 7.4917 8.6241 3.0271 5.2148 5.1538 5.0993 10.6830 1.4953 5.0806 1.5408 1.4352 4.1781 1.5847 1.4102 1.3701 8.6448 6.9850 1.3413 8.3704 8.2110 2.9950 1.8083 1.5042 1.3997 1.1466 2.9015 10.5418 2.3890 2.1321 1.4721 2.5176 5.7198 10.6161 7.1645 4.8043 3.3071 2.6941 3.0414 7.9689 7.0280 7.0903 7.2787 1.0885 1.0887 1.0938 1.0942 1.0952 1.0943 1.0973
irintensity: 0.0191 0.4235 1.5963 0.4684 0.3850 1.2619 2.8096 0.3862 0.0412 1.4680 4.5412 0.2212 8.3152 0.3867 2.7967 0.8198 2.4668 2.0875 2.6065 3.8560 5.5036 7.1655 0.8623 6.1659 6.8823 0.1402 16.1255 3.8602 12.9816 4.7788 6.1950 14.4021 14.3914 40.4932 14.5457 32.9011 53.0759 27.7526 42.3910 38.9045 35.5190 13.4283 9.9758 5.3989 155.8317 60.3587 1.8573 292.6890 63.5139 77.6914 6.3202 29.0142 6.4260 4.3696 30.2969 290.4372 118.0937 376.5889 149.0390 286.4993 22.1185 95.9692 25.3366 23.7835 15.3444 228.6270 43.6703 4.8929 8.1876 160.3853 2.0276 8.6871 2.3564 0.5568 1.5439 2.4035 5.3977 4.3829
temp: 298.150 k
press: 1.00000 atm
elementType: 17 9 9 9 8 8 8 7 6 6 6 6 6 6 6 6 6 6 6 6 6 1 1 1 1 1 1 1
symmnumber: 1
zpe: 462443.4 jmol-1
zpe.correction: 0.176135 hartree
zpe.thermalcorrener: 0.194323 hartree
zpe.thermalcorrenthalpy: 0.195268 hartree
zpe.thermalcorrgfe: 0.125483 hartree
zpe.sumelectzpe: -1538.016808 hartree
zpe.sumelectthermal: -1537.998620 hartree
zpe.sumelectthermalent: -1537.997676 hartree
zpe.sumelectthermalfe: -1538.067461 hartree
dipole: -2.3899 3.5570 3.3088
dipole: 5.4141
quadrupole: -139.4403 -135.7090 -125.0407
quadrupole: -11.4238 -12.6163 -3.4457
quadrupole: -6.0437 -2.3123 8.3560 -11.4238 -12.6163 -3.4457
hfenergy: -1538.1929438 hartree
pointgroup: C01 [X(C13H7Cl1F3N1O3)]
dipole: 0.9938525 1.7167288 -0.7761213 debye
polarizability: 243.9201652|5.9387467|170.1881122|-24.1314072|19.7266691|117.2007278 unknown
InChI: InChI=1S/C13H7ClF3NO3/c14-11-6-8(13(15,16)17)4-5-12(11)21-10-3-1-2-9(7-10)18(19)20/h1-7H
charge 0 multiplicity 1
28 atoms
Cl -1.255764 2.582661 2.380746
F  -4.843693 -0.922682 -1.619302
F  -4.571929 -1.92125 0.393434
F  -5.512863 0.135357 0.279955
O  0.673275 1.744134 0.284164
O  4.950175 -2.532042 -0.382751
O  2.812015 -2.891825 0.325643
N  3.760939 -2.125025 -0.095119
C  -3.129847 -0.034212 -0.151436
C  -0.552849 1.078445 0.132321
C  -2.871769 0.870889 0.903062
C  -2.108202 -0.379294 -1.066235
C  1.899623 1.150821 -0.0985
C  -1.58768 1.422173 1.03753
C  -0.825464 0.180478 -0.927718
C  2.168297 -0.222883 0.067579
C  -4.486395 -0.664818 -0.273327
C  3.462517 -0.675545 -0.262775
C  2.892626 2.044806 -0.560011
C  4.479348 0.18175 -0.733505
C  4.177834 1.553514 -0.873057
H  -3.660588 1.149036 1.607033
H  -2.317748 -1.06526 -1.891702
H  -0.039388 -0.06585 -1.646876
H  1.429376 -0.930376 0.452628
H  2.644263 3.10525 -0.658328
H  5.463931 -0.226397 -0.972928
H  4.94696 2.244745 -1.230425
